Wed Aug 12 05:54:40 2026 ===  0.000000 === build starting
Wed Aug 12 05:54:40 2026 ===  0.000070 === version 20190516
Wed Aug 12 05:54:40 2026 ===  0.000025 === hostname pkgsrchostname
Wed Aug 12 05:54:40 2026 ===  0.000187 === compilers/abiname.c compiling gcc -fPIC -Wall -fomit-frame-pointer -fwrapv -O3
Wed Aug 12 05:54:41 2026 ===  0.109975 === compilers/abiname.c compiling gcc -fPIC -Wall -fomit-frame-pointer -fwrapv -march=core-avx2 -O3
Wed Aug 12 05:54:41 2026 ===  0.087813 === compilers/abiname.c compiling clang -fPIC -Wall -fomit-frame-pointer -fwrapv -Qunused-arguments -O3
Wed Aug 12 05:54:41 2026 ===  0.013411 === output
> gcc: error: unrecognized command-line option ‘-Qunused-arguments’
Wed Aug 12 05:54:41 2026 ===  0.000444 === compilers/abiname.c compiler exited 1
Wed Aug 12 05:54:41 2026 ===  0.018348 === output
> gcc: error: unrecognized command-line option ‘-Qunused-arguments’
Wed Aug 12 05:54:41 2026 ===  0.000377 === compilers/base.c compiler exited 1
Wed Aug 12 05:54:41 2026 ===  0.010867 === compilers/abiname.c compiling clang -fPIC -Wall -fomit-frame-pointer -fwrapv -Qunused-arguments -mavx2 -O3
Wed Aug 12 05:54:41 2026 ===  0.014135 === output
> gcc: error: unrecognized command-line option ‘-Qunused-arguments’
Wed Aug 12 05:54:41 2026 ===  0.000455 === compilers/abiname.c compiler exited 1
Wed Aug 12 05:54:41 2026 ===  0.013009 === output
> gcc: error: unrecognized command-line option ‘-Qunused-arguments’
Wed Aug 12 05:54:41 2026 ===  0.000387 === compilers/base.c compiler exited 1
Wed Aug 12 05:54:41 2026 ===  0.007208 === cpucycles/amd64cpuinfo compiling gcc -fPIC -Wall -fomit-frame-pointer -fwrapv -O3
Wed Aug 12 05:54:41 2026 ===  0.217494 === cpucycles/amd64cpuinfo compiling gcc -fPIC -Wall -fomit-frame-pointer -fwrapv -march=core-avx2 -O3
Wed Aug 12 05:54:41 2026 ===  0.207652 === cpucycles/amd64cpuinfo compiling clang -fPIC -Wall -fomit-frame-pointer -fwrapv -Qunused-arguments -O3
Wed Aug 12 05:54:41 2026 ===  0.012142 === output
> gcc: error: unrecognized command-line option ‘-Qunused-arguments’
Wed Aug 12 05:54:41 2026 ===  0.000403 === cpucycles/cpucycles.c compiler exited 1
Wed Aug 12 05:54:41 2026 ===  0.000276 === cpucycles/amd64cpuinfo compiling clang -fPIC -Wall -fomit-frame-pointer -fwrapv -Qunused-arguments -mavx2 -O3
Wed Aug 12 05:54:41 2026 ===  0.016350 === output
> gcc: error: unrecognized command-line option ‘-Qunused-arguments’
Wed Aug 12 05:54:41 2026 ===  0.000324 === cpucycles/cpucycles.c compiler exited 1
Wed Aug 12 05:54:41 2026 ===  0.000249 === cpucycles/amd64cpuspeed compiling gcc -fPIC -Wall -fomit-frame-pointer -fwrapv -O3
Wed Aug 12 05:54:41 2026 ===  0.025766 === output
> cpucycles.c: In function ‘djbsort_cpucycles_persecond’:
> cpucycles.c:21:12: error: ‘HW_CPUSPEED’ undeclared (first use in this function)
>    21 |   oid[1] = HW_CPUSPEED;
>       |            ^~~~~~~~~~~
> cpucycles.c:21:12: note: each undeclared identifier is reported only once for each function it appears in
Wed Aug 12 05:54:41 2026 ===  0.000445 === cpucycles/cpucycles.c compiler exited 1
Wed Aug 12 05:54:41 2026 ===  0.000254 === cpucycles/amd64cpuspeed compiling gcc -fPIC -Wall -fomit-frame-pointer -fwrapv -march=core-avx2 -O3
Wed Aug 12 05:54:41 2026 ===  0.038540 === output
> cpucycles.c: In function ‘djbsort_cpucycles_persecond’:
> cpucycles.c:21:12: error: ‘HW_CPUSPEED’ undeclared (first use in this function)
>    21 |   oid[1] = HW_CPUSPEED;
>       |            ^~~~~~~~~~~
> cpucycles.c:21:12: note: each undeclared identifier is reported only once for each function it appears in
Wed Aug 12 05:54:41 2026 ===  0.000460 === cpucycles/cpucycles.c compiler exited 1
Wed Aug 12 05:54:41 2026 ===  0.000225 === cpucycles/amd64cpuspeed compiling clang -fPIC -Wall -fomit-frame-pointer -fwrapv -Qunused-arguments -O3
Wed Aug 12 05:54:41 2026 ===  0.010572 === output
> gcc: error: unrecognized command-line option ‘-Qunused-arguments’
Wed Aug 12 05:54:41 2026 ===  0.000320 === cpucycles/cpucycles.c compiler exited 1
Wed Aug 12 05:54:41 2026 ===  0.000196 === cpucycles/amd64cpuspeed compiling clang -fPIC -Wall -fomit-frame-pointer -fwrapv -Qunused-arguments -mavx2 -O3
Wed Aug 12 05:54:41 2026 ===  0.016594 === output
> gcc: error: unrecognized command-line option ‘-Qunused-arguments’
Wed Aug 12 05:54:41 2026 ===  0.000385 === cpucycles/cpucycles.c compiler exited 1
Wed Aug 12 05:54:41 2026 ===  0.000266 === cpucycles/amd64tscfreq compiling gcc -fPIC -Wall -fomit-frame-pointer -fwrapv -O3
Wed Aug 12 05:54:41 2026 ===  0.049926 === output
> cpucycles.c: In function ‘djbsort_cpucycles_persecond’:
> cpucycles.c:17:3: warning: implicit declaration of function ‘sysctlbyname’ [-Wimplicit-function-declaration]
>    17 |   sysctlbyname("machdep.tsc_freq",&result,&resultlen,0,0);
>       |   ^~~~~~~~~~~~
Wed Aug 12 05:54:41 2026 ===  0.123891 === cpucycles/amd64tscfreq compiling gcc -fPIC -Wall -fomit-frame-pointer -fwrapv -march=core-avx2 -O3
Wed Aug 12 05:54:42 2026 ===  0.058713 === output
> cpucycles.c: In function ‘djbsort_cpucycles_persecond’:
> cpucycles.c:17:3: warning: implicit declaration of function ‘sysctlbyname’ [-Wimplicit-function-declaration]
>    17 |   sysctlbyname("machdep.tsc_freq",&result,&resultlen,0,0);
>       |   ^~~~~~~~~~~~
Wed Aug 12 05:54:42 2026 ===  0.145437 === cpucycles/amd64tscfreq compiling clang -fPIC -Wall -fomit-frame-pointer -fwrapv -Qunused-arguments -O3
Wed Aug 12 05:54:42 2026 ===  0.011588 === output
> gcc: error: unrecognized command-line option ‘-Qunused-arguments’
Wed Aug 12 05:54:42 2026 ===  0.000295 === cpucycles/cpucycles.c compiler exited 1
Wed Aug 12 05:54:42 2026 ===  0.000151 === cpucycles/amd64tscfreq compiling clang -fPIC -Wall -fomit-frame-pointer -fwrapv -Qunused-arguments -mavx2 -O3
Wed Aug 12 05:54:42 2026 ===  0.011190 === output
> gcc: error: unrecognized command-line option ‘-Qunused-arguments’
Wed Aug 12 05:54:42 2026 ===  0.000384 === cpucycles/cpucycles.c compiler exited 1
Wed Aug 12 05:54:42 2026 ===  0.000085 === cpucycles/apple compiling gcc -fPIC -Wall -fomit-frame-pointer -fwrapv -O3
Wed Aug 12 05:54:42 2026 ===  0.035232 === output
> cpucycles.c:6:10: fatal error: mach/mach_time.h: No such file or directory
>     6 | #include <mach/mach_time.h>
>       |          ^~~~~~~~~~~~~~~~~~
> compilation terminated.
Wed Aug 12 05:54:42 2026 ===  0.000384 === cpucycles/cpucycles.c compiler exited 1
Wed Aug 12 05:54:42 2026 ===  0.000079 === cpucycles/apple compiling gcc -fPIC -Wall -fomit-frame-pointer -fwrapv -march=core-avx2 -O3
Wed Aug 12 05:54:42 2026 ===  0.045162 === output
> cpucycles.c:6:10: fatal error: mach/mach_time.h: No such file or directory
>     6 | #include <mach/mach_time.h>
>       |          ^~~~~~~~~~~~~~~~~~
> compilation terminated.
Wed Aug 12 05:54:42 2026 ===  0.000374 === cpucycles/cpucycles.c compiler exited 1
Wed Aug 12 05:54:42 2026 ===  0.000092 === cpucycles/apple compiling clang -fPIC -Wall -fomit-frame-pointer -fwrapv -Qunused-arguments -O3
Wed Aug 12 05:54:42 2026 ===  0.015297 === output
> gcc: error: unrecognized command-line option ‘-Qunused-arguments’
Wed Aug 12 05:54:42 2026 ===  0.001291 === cpucycles/cpucycles.c compiler exited 1
Wed Aug 12 05:54:42 2026 ===  0.000098 === cpucycles/apple compiling clang -fPIC -Wall -fomit-frame-pointer -fwrapv -Qunused-arguments -mavx2 -O3
Wed Aug 12 05:54:42 2026 ===  0.014768 === output
> gcc: error: unrecognized command-line option ‘-Qunused-arguments’
Wed Aug 12 05:54:42 2026 ===  0.000488 === cpucycles/cpucycles.c compiler exited 1
Wed Aug 12 05:54:42 2026 ===  0.000337 === cpucycles/celllinux skipping architecture gcc -fPIC -Wall -fomit-frame-pointer -fwrapv -O3
Wed Aug 12 05:54:42 2026 ===  0.000116 === cpucycles/celllinux skipping architecture gcc -fPIC -Wall -fomit-frame-pointer -fwrapv -march=core-avx2 -O3
Wed Aug 12 05:54:42 2026 ===  0.000089 === cpucycles/celllinux skipping architecture clang -fPIC -Wall -fomit-frame-pointer -fwrapv -Qunused-arguments -O3
Wed Aug 12 05:54:42 2026 ===  0.000085 === cpucycles/celllinux skipping architecture clang -fPIC -Wall -fomit-frame-pointer -fwrapv -Qunused-arguments -mavx2 -O3
Wed Aug 12 05:54:42 2026 ===  0.000121 === cpucycles/cortex skipping architecture gcc -fPIC -Wall -fomit-frame-pointer -fwrapv -O3
Wed Aug 12 05:54:42 2026 ===  0.000086 === cpucycles/cortex skipping architecture gcc -fPIC -Wall -fomit-frame-pointer -fwrapv -march=core-avx2 -O3
Wed Aug 12 05:54:42 2026 ===  0.000091 === cpucycles/cortex skipping architecture clang -fPIC -Wall -fomit-frame-pointer -fwrapv -Qunused-arguments -O3
Wed Aug 12 05:54:42 2026 ===  0.000092 === cpucycles/cortex skipping architecture clang -fPIC -Wall -fomit-frame-pointer -fwrapv -Qunused-arguments -mavx2 -O3
Wed Aug 12 05:54:42 2026 ===  0.000130 === cpucycles/cortex_vct skipping architecture gcc -fPIC -Wall -fomit-frame-pointer -fwrapv -O3
Wed Aug 12 05:54:42 2026 ===  0.000086 === cpucycles/cortex_vct skipping architecture gcc -fPIC -Wall -fomit-frame-pointer -fwrapv -march=core-avx2 -O3
Wed Aug 12 05:54:42 2026 ===  0.000083 === cpucycles/cortex_vct skipping architecture clang -fPIC -Wall -fomit-frame-pointer -fwrapv -Qunused-arguments -O3
Wed Aug 12 05:54:42 2026 ===  0.000089 === cpucycles/cortex_vct skipping architecture clang -fPIC -Wall -fomit-frame-pointer -fwrapv -Qunused-arguments -mavx2 -O3
Wed Aug 12 05:54:42 2026 ===  0.000105 === cpucycles/dev4ns compiling gcc -fPIC -Wall -fomit-frame-pointer -fwrapv -O3
Wed Aug 12 05:54:42 2026 ===  0.197076 === cpucycles/dev4ns compiling gcc -fPIC -Wall -fomit-frame-pointer -fwrapv -march=core-avx2 -O3
Wed Aug 12 05:54:42 2026 ===  0.226781 === cpucycles/dev4ns compiling clang -fPIC -Wall -fomit-frame-pointer -fwrapv -Qunused-arguments -O3
Wed Aug 12 05:54:42 2026 ===  0.014767 === output
> gcc: error: unrecognized command-line option ‘-Qunused-arguments’
Wed Aug 12 05:54:42 2026 ===  0.000358 === cpucycles/cpucycles.c compiler exited 1
Wed Aug 12 05:54:42 2026 ===  0.000088 === cpucycles/dev4ns compiling clang -fPIC -Wall -fomit-frame-pointer -fwrapv -Qunused-arguments -mavx2 -O3
Wed Aug 12 05:54:42 2026 ===  0.015279 === output
> gcc: error: unrecognized command-line option ‘-Qunused-arguments’
Wed Aug 12 05:54:42 2026 ===  0.000351 === cpucycles/cpucycles.c compiler exited 1
Wed Aug 12 05:54:42 2026 ===  0.000101 === cpucycles/gettimeofday compiling gcc -fPIC -Wall -fomit-frame-pointer -fwrapv -O3
Wed Aug 12 05:54:43 2026 ===  0.222163 === cpucycles/gettimeofday compiling gcc -fPIC -Wall -fomit-frame-pointer -fwrapv -march=core-avx2 -O3
Wed Aug 12 05:54:43 2026 ===  0.230802 === cpucycles/gettimeofday compiling clang -fPIC -Wall -fomit-frame-pointer -fwrapv -Qunused-arguments -O3
Wed Aug 12 05:54:43 2026 ===  0.015585 === output
> gcc: error: unrecognized command-line option ‘-Qunused-arguments’
Wed Aug 12 05:54:43 2026 ===  0.000445 === cpucycles/cpucycles.c compiler exited 1
Wed Aug 12 05:54:43 2026 ===  0.000109 === cpucycles/gettimeofday compiling clang -fPIC -Wall -fomit-frame-pointer -fwrapv -Qunused-arguments -mavx2 -O3
Wed Aug 12 05:54:43 2026 ===  0.015388 === output
> gcc: error: unrecognized command-line option ‘-Qunused-arguments’
Wed Aug 12 05:54:43 2026 ===  0.000671 === cpucycles/cpucycles.c compiler exited 1
Wed Aug 12 05:54:43 2026 ===  0.000328 === cpucycles/ia64cpuinfo skipping architecture gcc -fPIC -Wall -fomit-frame-pointer -fwrapv -O3
Wed Aug 12 05:54:43 2026 ===  0.000089 === cpucycles/ia64cpuinfo skipping architecture gcc -fPIC -Wall -fomit-frame-pointer -fwrapv -march=core-avx2 -O3
Wed Aug 12 05:54:43 2026 ===  0.000095 === cpucycles/ia64cpuinfo skipping architecture clang -fPIC -Wall -fomit-frame-pointer -fwrapv -Qunused-arguments -O3
Wed Aug 12 05:54:43 2026 ===  0.000081 === cpucycles/ia64cpuinfo skipping architecture clang -fPIC -Wall -fomit-frame-pointer -fwrapv -Qunused-arguments -mavx2 -O3
Wed Aug 12 05:54:43 2026 ===  0.000138 === cpucycles/mips skipping architecture gcc -fPIC -Wall -fomit-frame-pointer -fwrapv -O3
Wed Aug 12 05:54:43 2026 ===  0.000081 === cpucycles/mips skipping architecture gcc -fPIC -Wall -fomit-frame-pointer -fwrapv -march=core-avx2 -O3
Wed Aug 12 05:54:43 2026 ===  0.000068 === cpucycles/mips skipping architecture clang -fPIC -Wall -fomit-frame-pointer -fwrapv -Qunused-arguments -O3
Wed Aug 12 05:54:43 2026 ===  0.000082 === cpucycles/mips skipping architecture clang -fPIC -Wall -fomit-frame-pointer -fwrapv -Qunused-arguments -mavx2 -O3
Wed Aug 12 05:54:43 2026 ===  0.000062 === cpucycles/monotonic compiling gcc -fPIC -Wall -fomit-frame-pointer -fwrapv -O3
Wed Aug 12 05:54:43 2026 ===  0.231684 === cpucycles/monotonic compiling gcc -fPIC -Wall -fomit-frame-pointer -fwrapv -march=core-avx2 -O3
Wed Aug 12 05:54:43 2026 ===  0.216339 === cpucycles/monotonic compiling clang -fPIC -Wall -fomit-frame-pointer -fwrapv -Qunused-arguments -O3
Wed Aug 12 05:54:43 2026 ===  0.017266 === output
> gcc: error: unrecognized command-line option ‘-Qunused-arguments’
Wed Aug 12 05:54:43 2026 ===  0.000978 === cpucycles/cpucycles.c compiler exited 1
Wed Aug 12 05:54:43 2026 ===  0.000207 === cpucycles/monotonic compiling clang -fPIC -Wall -fomit-frame-pointer -fwrapv -Qunused-arguments -mavx2 -O3
Wed Aug 12 05:54:43 2026 ===  0.015763 === output
> gcc: error: unrecognized command-line option ‘-Qunused-arguments’
Wed Aug 12 05:54:43 2026 ===  0.000413 === cpucycles/cpucycles.c compiler exited 1
Wed Aug 12 05:54:43 2026 ===  0.000138 === cpucycles/monotoniccpuinfo compiling gcc -fPIC -Wall -fomit-frame-pointer -fwrapv -O3
Wed Aug 12 05:54:43 2026 ===  0.209008 === cpucycles/monotoniccpuinfo compiling gcc -fPIC -Wall -fomit-frame-pointer -fwrapv -march=core-avx2 -O3
Wed Aug 12 05:54:44 2026 ===  0.250351 === cpucycles/monotoniccpuinfo compiling clang -fPIC -Wall -fomit-frame-pointer -fwrapv -Qunused-arguments -O3
Wed Aug 12 05:54:44 2026 ===  0.022960 === output
> gcc: error: unrecognized command-line option ‘-Qunused-arguments’
Wed Aug 12 05:54:44 2026 ===  0.000656 === cpucycles/cpucycles.c compiler exited 1
Wed Aug 12 05:54:44 2026 ===  0.000171 === cpucycles/monotoniccpuinfo compiling clang -fPIC -Wall -fomit-frame-pointer -fwrapv -Qunused-arguments -mavx2 -O3
Wed Aug 12 05:54:44 2026 ===  0.017477 === output
> gcc: error: unrecognized command-line option ‘-Qunused-arguments’
Wed Aug 12 05:54:44 2026 ===  0.002576 === cpucycles/cpucycles.c compiler exited 1
Wed Aug 12 05:54:44 2026 ===  0.000199 === cpucycles/perfevent compiling gcc -fPIC -Wall -fomit-frame-pointer -fwrapv -O3
Wed Aug 12 05:54:44 2026 ===  0.033341 === output
> cpucycles.c:6:10: fatal error: linux/perf_event.h: No such file or directory
>     6 | #include <linux/perf_event.h>
>       |          ^~~~~~~~~~~~~~~~~~~~
> compilation terminated.
Wed Aug 12 05:54:44 2026 ===  0.002007 === cpucycles/cpucycles.c compiler exited 1
Wed Aug 12 05:54:44 2026 ===  0.000365 === cpucycles/perfevent compiling gcc -fPIC -Wall -fomit-frame-pointer -fwrapv -march=core-avx2 -O3
Wed Aug 12 05:54:44 2026 ===  0.044166 === output
> cpucycles.c:6:10: fatal error: linux/perf_event.h: No such file or directory
>     6 | #include <linux/perf_event.h>
>       |          ^~~~~~~~~~~~~~~~~~~~
> compilation terminated.
Wed Aug 12 05:54:44 2026 ===  0.002836 === cpucycles/cpucycles.c compiler exited 1
Wed Aug 12 05:54:44 2026 ===  0.000376 === cpucycles/perfevent compiling clang -fPIC -Wall -fomit-frame-pointer -fwrapv -Qunused-arguments -O3
Wed Aug 12 05:54:44 2026 ===  0.016390 === output
> gcc: error: unrecognized command-line option ‘-Qunused-arguments’
Wed Aug 12 05:54:44 2026 ===  0.000762 === cpucycles/cpucycles.c compiler exited 1
Wed Aug 12 05:54:44 2026 ===  0.000151 === cpucycles/perfevent compiling clang -fPIC -Wall -fomit-frame-pointer -fwrapv -Qunused-arguments -mavx2 -O3
Wed Aug 12 05:54:44 2026 ===  0.016279 === output
> gcc: error: unrecognized command-line option ‘-Qunused-arguments’
Wed Aug 12 05:54:44 2026 ===  0.000594 === cpucycles/cpucycles.c compiler exited 1
Wed Aug 12 05:54:44 2026 ===  0.000361 === cpucycles/powerpccpuinfo skipping architecture gcc -fPIC -Wall -fomit-frame-pointer -fwrapv -O3
Wed Aug 12 05:54:44 2026 ===  0.000279 === cpucycles/powerpccpuinfo skipping architecture gcc -fPIC -Wall -fomit-frame-pointer -fwrapv -march=core-avx2 -O3
Wed Aug 12 05:54:44 2026 ===  0.000217 === cpucycles/powerpccpuinfo skipping architecture clang -fPIC -Wall -fomit-frame-pointer -fwrapv -Qunused-arguments -O3
Wed Aug 12 05:54:44 2026 ===  0.000166 === cpucycles/powerpccpuinfo skipping architecture clang -fPIC -Wall -fomit-frame-pointer -fwrapv -Qunused-arguments -mavx2 -O3
Wed Aug 12 05:54:44 2026 ===  0.000207 === cpucycles/powerpcmacos skipping architecture gcc -fPIC -Wall -fomit-frame-pointer -fwrapv -O3
Wed Aug 12 05:54:44 2026 ===  0.000117 === cpucycles/powerpcmacos skipping architecture gcc -fPIC -Wall -fomit-frame-pointer -fwrapv -march=core-avx2 -O3
Wed Aug 12 05:54:44 2026 ===  0.000102 === cpucycles/powerpcmacos skipping architecture clang -fPIC -Wall -fomit-frame-pointer -fwrapv -Qunused-arguments -O3
Wed Aug 12 05:54:44 2026 ===  0.000129 === cpucycles/powerpcmacos skipping architecture clang -fPIC -Wall -fomit-frame-pointer -fwrapv -Qunused-arguments -mavx2 -O3
Wed Aug 12 05:54:44 2026 ===  0.000184 === cpucycles/sparc32cpuinfo skipping architecture gcc -fPIC -Wall -fomit-frame-pointer -fwrapv -O3
Wed Aug 12 05:54:44 2026 ===  0.000159 === cpucycles/sparc32cpuinfo skipping architecture gcc -fPIC -Wall -fomit-frame-pointer -fwrapv -march=core-avx2 -O3
Wed Aug 12 05:54:44 2026 ===  0.000120 === cpucycles/sparc32cpuinfo skipping architecture clang -fPIC -Wall -fomit-frame-pointer -fwrapv -Qunused-arguments -O3
Wed Aug 12 05:54:44 2026 ===  0.000129 === cpucycles/sparc32cpuinfo skipping architecture clang -fPIC -Wall -fomit-frame-pointer -fwrapv -Qunused-arguments -mavx2 -O3
Wed Aug 12 05:54:44 2026 ===  0.000153 === cpucycles/sparccpuinfo skipping architecture gcc -fPIC -Wall -fomit-frame-pointer -fwrapv -O3
Wed Aug 12 05:54:44 2026 ===  0.000114 === cpucycles/sparccpuinfo skipping architecture gcc -fPIC -Wall -fomit-frame-pointer -fwrapv -march=core-avx2 -O3
Wed Aug 12 05:54:44 2026 ===  0.000102 === cpucycles/sparccpuinfo skipping architecture clang -fPIC -Wall -fomit-frame-pointer -fwrapv -Qunused-arguments -O3
Wed Aug 12 05:54:44 2026 ===  0.000127 === cpucycles/sparccpuinfo skipping architecture clang -fPIC -Wall -fomit-frame-pointer -fwrapv -Qunused-arguments -mavx2 -O3
Wed Aug 12 05:54:44 2026 ===  0.000359 === cpucycles/vct skipping architecture gcc -fPIC -Wall -fomit-frame-pointer -fwrapv -O3
Wed Aug 12 05:54:44 2026 ===  0.000091 === cpucycles/vct skipping architecture gcc -fPIC -Wall -fomit-frame-pointer -fwrapv -march=core-avx2 -O3
Wed Aug 12 05:54:44 2026 ===  0.000083 === cpucycles/vct skipping architecture clang -fPIC -Wall -fomit-frame-pointer -fwrapv -Qunused-arguments -O3
Wed Aug 12 05:54:44 2026 ===  0.000082 === cpucycles/vct skipping architecture clang -fPIC -Wall -fomit-frame-pointer -fwrapv -Qunused-arguments -mavx2 -O3
Wed Aug 12 05:54:44 2026 ===  0.000127 === cpucycles/x86cpuinfo skipping architecture gcc -fPIC -Wall -fomit-frame-pointer -fwrapv -O3
Wed Aug 12 05:54:44 2026 ===  0.000085 === cpucycles/x86cpuinfo skipping architecture gcc -fPIC -Wall -fomit-frame-pointer -fwrapv -march=core-avx2 -O3
Wed Aug 12 05:54:44 2026 ===  0.000078 === cpucycles/x86cpuinfo skipping architecture clang -fPIC -Wall -fomit-frame-pointer -fwrapv -Qunused-arguments -O3
Wed Aug 12 05:54:44 2026 ===  0.000082 === cpucycles/x86cpuinfo skipping architecture clang -fPIC -Wall -fomit-frame-pointer -fwrapv -Qunused-arguments -mavx2 -O3
Wed Aug 12 05:54:44 2026 ===  0.000132 === cpucycles/x86cpuspeed skipping architecture gcc -fPIC -Wall -fomit-frame-pointer -fwrapv -O3
Wed Aug 12 05:54:44 2026 ===  0.000084 === cpucycles/x86cpuspeed skipping architecture gcc -fPIC -Wall -fomit-frame-pointer -fwrapv -march=core-avx2 -O3
Wed Aug 12 05:54:44 2026 ===  0.000083 === cpucycles/x86cpuspeed skipping architecture clang -fPIC -Wall -fomit-frame-pointer -fwrapv -Qunused-arguments -O3
Wed Aug 12 05:54:44 2026 ===  0.000075 === cpucycles/x86cpuspeed skipping architecture clang -fPIC -Wall -fomit-frame-pointer -fwrapv -Qunused-arguments -mavx2 -O3
Wed Aug 12 05:54:44 2026 ===  0.000126 === cpucycles/x86estimate skipping architecture gcc -fPIC -Wall -fomit-frame-pointer -fwrapv -O3
Wed Aug 12 05:54:44 2026 ===  0.000087 === cpucycles/x86estimate skipping architecture gcc -fPIC -Wall -fomit-frame-pointer -fwrapv -march=core-avx2 -O3
Wed Aug 12 05:54:44 2026 ===  0.000089 === cpucycles/x86estimate skipping architecture clang -fPIC -Wall -fomit-frame-pointer -fwrapv -Qunused-arguments -O3
Wed Aug 12 05:54:44 2026 ===  0.000079 === cpucycles/x86estimate skipping architecture clang -fPIC -Wall -fomit-frame-pointer -fwrapv -Qunused-arguments -mavx2 -O3
Wed Aug 12 05:54:44 2026 ===  0.000126 === cpucycles/x86tscfreq skipping architecture gcc -fPIC -Wall -fomit-frame-pointer -fwrapv -O3
Wed Aug 12 05:54:44 2026 ===  0.000140 === cpucycles/x86tscfreq skipping architecture gcc -fPIC -Wall -fomit-frame-pointer -fwrapv -march=core-avx2 -O3
Wed Aug 12 05:54:44 2026 ===  0.000115 === cpucycles/x86tscfreq skipping architecture clang -fPIC -Wall -fomit-frame-pointer -fwrapv -Qunused-arguments -O3
Wed Aug 12 05:54:44 2026 ===  0.000141 === cpucycles/x86tscfreq skipping architecture clang -fPIC -Wall -fomit-frame-pointer -fwrapv -Qunused-arguments -mavx2 -O3
Wed Aug 12 05:54:44 2026 ===  0.002623 === int32/avx2 compiling gcc -fPIC -Wall -fomit-frame-pointer -fwrapv -O3
Wed Aug 12 05:54:44 2026 ===  0.000617 === int32/avx2/sort.c compiling
Wed Aug 12 05:54:44 2026 ===  0.434063 === output
> sort.c: In function ‘djbsort_int32’:
> sort.c:939:38: warning: AVX vector return without AVX enabled changes the ABI [-Wpsabi]
>   939 |     for (i = q>>3;i < q>>2;++i) y[i] = _mm256_set1_epi32(0x7fffffff);
>       |                                 ~~~~~^~~~~~~~~~~~~~~~~~~~~~~~~~~~~~~
> sort.c: In function ‘merge16_finish’:
> sort.c:54:13: note: the ABI for passing parameters with 32-byte alignment has changed in GCC 4.6
>    54 | static void merge16_finish(int32 *x,int32x8 x0,int32x8 x1,int flagdown)
>       |             ^~~~~~~~~~~~~~
> In file included from /usr/include/gcc-10/immintrin.h:51,
>                  from sort.c:4:
> sort.c: In function ‘minmax_vector’:
> /usr/include/gcc-10/avxintrin.h:926:1: error: inlining failed in call to ‘always_inline’ ‘_mm256_storeu_si256’: target specific option mismatch
>   926 | _mm256_storeu_si256 (__m256i_u *__P, __m256i __A)
>       | ^~~~~~~~~~~~~~~~~~~
> sort.c:9:28: note: called from here
>     9 | #define int32x8_store(z,i) _mm256_storeu_si256((__m256i *) (z),(i))
>       |                            ^~~~~~~~~~~~~~~~~~~~~~~~~~~~~~~~~~~~~~~~
> sort.c:37:5: note: in expansion of macro ‘int32x8_store’
>    37 |     int32x8_store(y + n - 8,y0);
>       |     ^~~~~~~~~~~~~
> In file included from /usr/include/gcc-10/immintrin.h:51,
>                  from sort.c:4:
> /usr/include/gcc-10/avxintrin.h:926:1: error: inlining failed in call to ‘always_inline’ ‘_mm256_storeu_si256’: target specific option mismatch
>   926 | _mm256_storeu_si256 (__m256i_u *__P, __m256i __A)
>       | ^~~~~~~~~~~~~~~~~~~
> sort.c:9:28: note: called from here
>     9 | #define int32x8_store(z,i) _mm256_storeu_si256((__m256i *) (z),(i))
>       |                            ^~~~~~~~~~~~~~~~~~~~~~~~~~~~~~~~~~~~~~~~
> sort.c:36:5: note: in expansion of macro ‘int32x8_store’
>    36 |     int32x8_store(x + n - 8,x0);
>       |     ^~~~~~~~~~~~~
> In file included from /usr/include/gcc-10/immintrin.h:53,
>                  from sort.c:4:
> /usr/include/gcc-10/avx2intrin.h:363:1: error: inlining failed in call to ‘always_inline’ ‘_mm256_max_epi32’: target specific option mismatch
>   363 | _mm256_max_epi32 (__m256i __A, __m256i __B)
>       | ^~~~~~~~~~~~~~~~
> sort.c:11:21: note: called from here
>    11 | #define int32x8_max _mm256_max_epi32
>       |                     ^
> sort.c:16:7: note: in expansion of macro ‘int32x8_max’
>    16 |   b = int32x8_max(a,b); \
>       |       ^~~~~~~~~~~
> sort.c:35:5: note: in expansion of macro ‘int32x8_MINMAX’
>    35 |     int32x8_MINMAX(x0,y0);
>       |     ^~~~~~~~~~~~~~
> In file included from /usr/include/gcc-10/immintrin.h:53,
>                  from sort.c:4:
> /usr/include/gcc-10/avx2intrin.h:405:1: error: inlining failed in call to ‘always_inline’ ‘_mm256_min_epi32’: target specific option mismatch
>   405 | _mm256_min_epi32 (__m256i __A, __m256i __B)
>       | ^~~~~~~~~~~~~~~~
> sort.c:10:21: note: called from here
>    10 | #define int32x8_min _mm256_min_epi32
>       |                     ^
> sort.c:15:15: note: in expansion of macro ‘int32x8_min’
>    15 |   int32x8 c = int32x8_min(a,b); \
>       |               ^~~~~~~~~~~
> sort.c:35:5: note: in expansion of macro ‘int32x8_MINMAX’
>    35 |     int32x8_MINMAX(x0,y0);
>       |     ^~~~~~~~~~~~~~
> In file included from /usr/include/gcc-10/immintrin.h:51,
>                  from sort.c:4:
> /usr/include/gcc-10/avxintrin.h:920:1: error: inlining failed in call to ‘always_inline’ ‘_mm256_loadu_si256’: target specific option mismatch
>   920 | _mm256_loadu_si256 (__m256i_u const *__P)
>       | ^~~~~~~~~~~~~~~~~~
> sort.c:8:25: note: called from here
>     8 | #define int32x8_load(z) _mm256_loadu_si256((__m256i *) (z))
>       |                         ^~~~~~~~~~~~~~~~~~~~~~~~~~~~~~~~~~~
> sort.c:34:18: note: in expansion of macro ‘int32x8_load’
>    34 |     int32x8 y0 = int32x8_load(y + n - 8);
>       |                  ^~~~~~~~~~~~
> In file included from /usr/include/gcc-10/immintrin.h:51,
>                  from sort.c:4:
> /usr/include/gcc-10/avxintrin.h:920:1: error: inlining failed in call to ‘always_inline’ ‘_mm256_loadu_si256’: target specific option mismatch
>   920 | _mm256_loadu_si256 (__m256i_u const *__P)
>       | ^~~~~~~~~~~~~~~~~~
> sort.c:8:25: note: called from here
>     8 | #define int32x8_load(z) _mm256_loadu_si256((__m256i *) (z))
>       |                         ^~~~~~~~~~~~~~~~~~~~~~~~~~~~~~~~~~~
> sort.c:33:18: note: in expansion of macro ‘int32x8_load’
>    33 |     int32x8 x0 = int32x8_load(x + n - 8);
>       |                  ^~~~~~~~~~~~
> In file included from /usr/include/gcc-10/immintrin.h:51,
>                  from sort.c:4:
> /usr/include/gcc-10/avxintrin.h:926:1: error: inlining failed in call to ‘always_inline’ ‘_mm256_storeu_si256’: target specific option mismatch
>   926 | _mm256_storeu_si256 (__m256i_u *__P, __m256i __A)
>       | ^~~~~~~~~~~~~~~~~~~
> sort.c:9:28: note: called from here
>     9 | #define int32x8_store(z,i) _mm256_storeu_si256((__m256i *) (z),(i))
>       |                            ^~~~~~~~~~~~~~~~~~~~~~~~~~~~~~~~~~~~~~~~
> sort.c:45:5: note: in expansion of macro ‘int32x8_store’
>    45 |     int32x8_store(y,y0);
>       |     ^~~~~~~~~~~~~
> In file included from /usr/include/gcc-10/immintrin.h:51,
>                  from sort.c:4:
> /usr/include/gcc-10/avxintrin.h:926:1: error: inlining failed in call to ‘always_inline’ ‘_mm256_storeu_si256’: target specific option mismatch
>   926 | _mm256_storeu_si256 (__m256i_u *__P, __m256i __A)
>       | ^~~~~~~~~~~~~~~~~~~
> sort.c:9:28: note: called from here
>     9 | #define int32x8_store(z,i) _mm256_storeu_si256((__m256i *) (z),(i))
>       |                            ^~~~~~~~~~~~~~~~~~~~~~~~~~~~~~~~~~~~~~~~
> sort.c:44:5: note: in expansion of macro ‘int32x8_store’
>    44 |     int32x8_store(x,x0);
>       |     ^~~~~~~~~~~~~
> In file included from /usr/include/gcc-10/immintrin.h:53,
>                  from sort.c:4:
> /usr/include/gcc-10/avx2intrin.h:363:1: error: inlining failed in call to ‘always_inline’ ‘_mm256_max_epi32’: target specific option mismatch
>   363 | _mm256_max_epi32 (__m256i __A, __m256i __B)
>       | ^~~~~~~~~~~~~~~~
> sort.c:11:21: note: called from here
>    11 | #define int32x8_max _mm256_max_epi32
>       |                     ^
> sort.c:16:7: note: in expansion of macro ‘int32x8_max’
>    16 |   b = int32x8_max(a,b); \
>       |       ^~~~~~~~~~~
> sort.c:43:5: note: in expansion of macro ‘int32x8_MINMAX’
>    43 |     int32x8_MINMAX(x0,y0);
>       |     ^~~~~~~~~~~~~~
> In file included from /usr/include/gcc-10/immintrin.h:53,
>                  from sort.c:4:
> /usr/include/gcc-10/avx2intrin.h:405:1: error: inlining failed in call to ‘always_inline’ ‘_mm256_min_epi32’: target specific option mismatch
>   405 | _mm256_min_epi32 (__m256i __A, __m256i __B)
>       | ^~~~~~~~~~~~~~~~
> sort.c:10:21: note: called from here
>    10 | #define int32x8_min _mm256_min_epi32
>       |                     ^
> sort.c:15:15: note: in expansion of macro ‘int32x8_min’
>    15 |   int32x8 c = int32x8_min(a,b); \
>       |               ^~~~~~~~~~~
> sort.c:43:5: note: in expansion of macro ‘int32x8_MINMAX’
>    43 |     int32x8_MINMAX(x0,y0);
>       |     ^~~~~~~~~~~~~~
> In file included from /usr/include/gcc-10/immintrin.h:51,
>                  from sort.c:4:
> /usr/include/gcc-10/avxintrin.h:920:1: error: inlining failed in call to ‘always_inline’ ‘_mm256_loadu_si256’: target specific option mismatch
>   920 | _mm256_loadu_si256 (__m256i_u const *__P)
>       | ^~~~~~~~~~~~~~~~~~
> sort.c:8:25: note: called from here
>     8 | #define int32x8_load(z) _mm256_loadu_si256((__m256i *) (z))
>       |                         ^~~~~~~~~~~~~~~~~~~~~~~~~~~~~~~~~~~
> sort.c:42:18: note: in expansion of macro ‘int32x8_load’
>    42 |     int32x8 y0 = int32x8_load(y);
>       |                  ^~~~~~~~~~~~
> In file included from /usr/include/gcc-10/immintrin.h:51,
>                  from sort.c:4:
> /usr/include/gcc-10/avxintrin.h:920:1: error: inlining failed in call to ‘always_inline’ ‘_mm256_loadu_si256’: target specific option mismatch
>   920 | _mm256_loadu_si256 (__m256i_u const *__P)
>       | ^~~~~~~~~~~~~~~~~~
> sort.c:8:25: note: called from here
>     8 | #define int32x8_load(z) _mm256_loadu_si256((__m256i *) (z))
>       |                         ^~~~~~~~~~~~~~~~~~~~~~~~~~~~~~~~~~~
> sort.c:41:18: note: in expansion of macro ‘int32x8_load’
>    41 |     int32x8 x0 = int32x8_load(x);
>       |                  ^~~~~~~~~~~~
Wed Aug 12 05:54:44 2026 ===  0.000521 === int32/avx2/sort.c compiler exited 1
Wed Aug 12 05:54:44 2026 ===  0.000112 === int32/avx2/compiler.c compiling
Wed Aug 12 05:54:44 2026 ===  0.027546 === int32/avx2/version.c compiling
Wed Aug 12 05:54:44 2026 ===  0.030776 === int32/avx2/implementation.c compiling
Wed Aug 12 05:54:44 2026 ===  0.031491 === int32/avx2/cycles.c compiling
Wed Aug 12 05:54:45 2026 ===  0.106967 === int32/avx2/works.c compiling
Wed Aug 12 05:54:45 2026 ===  0.233463 === int32/avx2 compiling gcc -fPIC -Wall -fomit-frame-pointer -fwrapv -march=core-avx2 -O3
Wed Aug 12 05:54:45 2026 ===  0.000308 === int32/avx2/sort.c compiling
Wed Aug 12 05:54:46 2026 ===  0.909041 === int32/avx2/compiler.c compiling
Wed Aug 12 05:54:46 2026 ===  0.032157 === int32/avx2/version.c compiling
Wed Aug 12 05:54:46 2026 ===  0.029893 === int32/avx2/implementation.c compiling
Wed Aug 12 05:54:46 2026 ===  0.030365 === int32/avx2/cycles.c compiling
Wed Aug 12 05:54:46 2026 ===  0.115347 === int32/avx2/works.c compiling
Wed Aug 12 05:54:46 2026 ===  0.262506 === int32/avx2 compiled gcc -fPIC -Wall -fomit-frame-pointer -fwrapv -march=core-avx2 -O3
Wed Aug 12 05:54:46 2026 ===  0.017877 === int32/avx2 compiling clang -fPIC -Wall -fomit-frame-pointer -fwrapv -Qunused-arguments -O3
Wed Aug 12 05:54:46 2026 ===  0.000290 === int32/avx2/sort.c compiling
Wed Aug 12 05:54:46 2026 ===  0.012256 === output
> gcc: error: unrecognized command-line option ‘-Qunused-arguments’
Wed Aug 12 05:54:46 2026 ===  0.000390 === int32/avx2/sort.c compiler exited 1
Wed Aug 12 05:54:46 2026 ===  0.000096 === int32/avx2/compiler.c compiling
Wed Aug 12 05:54:46 2026 ===  0.014159 === output
> gcc: error: unrecognized command-line option ‘-Qunused-arguments’
Wed Aug 12 05:54:46 2026 ===  0.000416 === int32/avx2/compiler.c compiler exited 1
Wed Aug 12 05:54:46 2026 ===  0.000096 === int32/avx2/version.c compiling
Wed Aug 12 05:54:46 2026 ===  0.016567 === output
> gcc: error: unrecognized command-line option ‘-Qunused-arguments’
Wed Aug 12 05:54:46 2026 ===  0.000474 === int32/avx2/version.c compiler exited 1
Wed Aug 12 05:54:46 2026 ===  0.000116 === int32/avx2/implementation.c compiling
Wed Aug 12 05:54:46 2026 ===  0.015705 === output
> gcc: error: unrecognized command-line option ‘-Qunused-arguments’
Wed Aug 12 05:54:46 2026 ===  0.000448 === int32/avx2/implementation.c compiler exited 1
Wed Aug 12 05:54:46 2026 ===  0.000113 === int32/avx2/cycles.c compiling
Wed Aug 12 05:54:46 2026 ===  0.016540 === output
> gcc: error: unrecognized command-line option ‘-Qunused-arguments’
Wed Aug 12 05:54:46 2026 ===  0.000428 === int32/avx2/cycles.c compiler exited 1
Wed Aug 12 05:54:46 2026 ===  0.000110 === int32/avx2/works.c compiling
Wed Aug 12 05:54:46 2026 ===  0.015862 === output
> gcc: error: unrecognized command-line option ‘-Qunused-arguments’
Wed Aug 12 05:54:46 2026 ===  0.000439 === int32/avx2/works.c compiler exited 1
Wed Aug 12 05:54:46 2026 ===  0.000273 === int32/avx2 compiling clang -fPIC -Wall -fomit-frame-pointer -fwrapv -Qunused-arguments -mavx2 -O3
Wed Aug 12 05:54:46 2026 ===  0.000184 === int32/avx2/sort.c compiling
Wed Aug 12 05:54:46 2026 ===  0.016316 === output
> gcc: error: unrecognized command-line option ‘-Qunused-arguments’
Wed Aug 12 05:54:46 2026 ===  0.000583 === int32/avx2/sort.c compiler exited 1
Wed Aug 12 05:54:46 2026 ===  0.000120 === int32/avx2/compiler.c compiling
Wed Aug 12 05:54:46 2026 ===  0.015838 === output
> gcc: error: unrecognized command-line option ‘-Qunused-arguments’
Wed Aug 12 05:54:46 2026 ===  0.000454 === int32/avx2/compiler.c compiler exited 1
Wed Aug 12 05:54:46 2026 ===  0.000110 === int32/avx2/version.c compiling
Wed Aug 12 05:54:46 2026 ===  0.016149 === output
> gcc: error: unrecognized command-line option ‘-Qunused-arguments’
Wed Aug 12 05:54:46 2026 ===  0.000453 === int32/avx2/version.c compiler exited 1
Wed Aug 12 05:54:46 2026 ===  0.000124 === int32/avx2/implementation.c compiling
Wed Aug 12 05:54:46 2026 ===  0.014524 === output
> gcc: error: unrecognized command-line option ‘-Qunused-arguments’
Wed Aug 12 05:54:46 2026 ===  0.000485 === int32/avx2/implementation.c compiler exited 1
Wed Aug 12 05:54:46 2026 ===  0.000138 === int32/avx2/cycles.c compiling
Wed Aug 12 05:54:46 2026 ===  0.017522 === output
> gcc: error: unrecognized command-line option ‘-Qunused-arguments’
Wed Aug 12 05:54:46 2026 ===  0.000463 === int32/avx2/cycles.c compiler exited 1
Wed Aug 12 05:54:46 2026 ===  0.000117 === int32/avx2/works.c compiling
Wed Aug 12 05:54:46 2026 ===  0.015313 === output
> gcc: error: unrecognized command-line option ‘-Qunused-arguments’
Wed Aug 12 05:54:46 2026 ===  0.000422 === int32/avx2/works.c compiler exited 1
Wed Aug 12 05:54:46 2026 ===  0.001823 === int32/portable3 compiling gcc -fPIC -Wall -fomit-frame-pointer -fwrapv -O3
Wed Aug 12 05:54:46 2026 ===  0.000129 === int32/portable3/sort.c compiling
Wed Aug 12 05:54:46 2026 ===  0.063696 === int32/portable3/compiler.c compiling
Wed Aug 12 05:54:46 2026 ===  0.029010 === int32/portable3/version.c compiling
Wed Aug 12 05:54:46 2026 ===  0.029334 === int32/portable3/implementation.c compiling
Wed Aug 12 05:54:46 2026 ===  0.032282 === int32/portable3/cycles.c compiling
Wed Aug 12 05:54:47 2026 ===  0.079765 === int32/portable3/works.c compiling
Wed Aug 12 05:54:47 2026 ===  0.220150 === int32/portable3 compiled gcc -fPIC -Wall -fomit-frame-pointer -fwrapv -O3
Wed Aug 12 05:54:47 2026 ===  0.018969 === int32/portable3 compiling gcc -fPIC -Wall -fomit-frame-pointer -fwrapv -march=core-avx2 -O3
Wed Aug 12 05:54:47 2026 ===  0.000258 === int32/portable3/sort.c compiling
Wed Aug 12 05:54:47 2026 ===  0.086700 === int32/portable3/compiler.c compiling
Wed Aug 12 05:54:47 2026 ===  0.038474 === int32/portable3/version.c compiling
Wed Aug 12 05:54:47 2026 ===  0.065638 === int32/portable3/implementation.c compiling
Wed Aug 12 05:54:47 2026 ===  0.028366 === int32/portable3/cycles.c compiling
Wed Aug 12 05:54:47 2026 ===  0.102157 === int32/portable3/works.c compiling
Wed Aug 12 05:54:47 2026 ===  0.246239 === int32/portable3 compiled gcc -fPIC -Wall -fomit-frame-pointer -fwrapv -march=core-avx2 -O3
Wed Aug 12 05:54:47 2026 ===  0.015571 === int32/portable3 compiling clang -fPIC -Wall -fomit-frame-pointer -fwrapv -Qunused-arguments -O3
Wed Aug 12 05:54:47 2026 ===  0.000191 === int32/portable3/sort.c compiling
Wed Aug 12 05:54:47 2026 ===  0.014533 === output
> gcc: error: unrecognized command-line option ‘-Qunused-arguments’
Wed Aug 12 05:54:47 2026 ===  0.000341 === int32/portable3/sort.c compiler exited 1
Wed Aug 12 05:54:47 2026 ===  0.000102 === int32/portable3/compiler.c compiling
Wed Aug 12 05:54:47 2026 ===  0.014045 === output
> gcc: error: unrecognized command-line option ‘-Qunused-arguments’
Wed Aug 12 05:54:47 2026 ===  0.000367 === int32/portable3/compiler.c compiler exited 1
Wed Aug 12 05:54:47 2026 ===  0.000082 === int32/portable3/version.c compiling
Wed Aug 12 05:54:47 2026 ===  0.024198 === output
> gcc: error: unrecognized command-line option ‘-Qunused-arguments’
Wed Aug 12 05:54:47 2026 ===  0.000353 === int32/portable3/version.c compiler exited 1
Wed Aug 12 05:54:47 2026 ===  0.000081 === int32/portable3/implementation.c compiling
Wed Aug 12 05:54:47 2026 ===  0.013425 === output
> gcc: error: unrecognized command-line option ‘-Qunused-arguments’
Wed Aug 12 05:54:47 2026 ===  0.000390 === int32/portable3/implementation.c compiler exited 1
Wed Aug 12 05:54:47 2026 ===  0.000090 === int32/portable3/cycles.c compiling
Wed Aug 12 05:54:47 2026 ===  0.014444 === output
> gcc: error: unrecognized command-line option ‘-Qunused-arguments’
Wed Aug 12 05:54:47 2026 ===  0.000385 === int32/portable3/cycles.c compiler exited 1
Wed Aug 12 05:54:47 2026 ===  0.000092 === int32/portable3/works.c compiling
Wed Aug 12 05:54:47 2026 ===  0.013877 === output
> gcc: error: unrecognized command-line option ‘-Qunused-arguments’
Wed Aug 12 05:54:47 2026 ===  0.000353 === int32/portable3/works.c compiler exited 1
Wed Aug 12 05:54:47 2026 ===  0.000090 === int32/portable3 compiling clang -fPIC -Wall -fomit-frame-pointer -fwrapv -Qunused-arguments -mavx2 -O3
Wed Aug 12 05:54:47 2026 ===  0.000164 === int32/portable3/sort.c compiling
Wed Aug 12 05:54:48 2026 ===  0.014223 === output
> gcc: error: unrecognized command-line option ‘-Qunused-arguments’
Wed Aug 12 05:54:48 2026 ===  0.000359 === int32/portable3/sort.c compiler exited 1
Wed Aug 12 05:54:48 2026 ===  0.000119 === int32/portable3/compiler.c compiling
Wed Aug 12 05:54:48 2026 ===  0.014654 === output
> gcc: error: unrecognized command-line option ‘-Qunused-arguments’
Wed Aug 12 05:54:48 2026 ===  0.000438 === int32/portable3/compiler.c compiler exited 1
Wed Aug 12 05:54:48 2026 ===  0.000099 === int32/portable3/version.c compiling
Wed Aug 12 05:54:48 2026 ===  0.014374 === output
> gcc: error: unrecognized command-line option ‘-Qunused-arguments’
Wed Aug 12 05:54:48 2026 ===  0.000421 === int32/portable3/version.c compiler exited 1
Wed Aug 12 05:54:48 2026 ===  0.000091 === int32/portable3/implementation.c compiling
Wed Aug 12 05:54:48 2026 ===  0.015166 === output
> gcc: error: unrecognized command-line option ‘-Qunused-arguments’
Wed Aug 12 05:54:48 2026 ===  0.000402 === int32/portable3/implementation.c compiler exited 1
Wed Aug 12 05:54:48 2026 ===  0.000105 === int32/portable3/cycles.c compiling
Wed Aug 12 05:54:48 2026 ===  0.015209 === output
> gcc: error: unrecognized command-line option ‘-Qunused-arguments’
Wed Aug 12 05:54:48 2026 ===  0.000394 === int32/portable3/cycles.c compiler exited 1
Wed Aug 12 05:54:48 2026 ===  0.000099 === int32/portable3/works.c compiling
Wed Aug 12 05:54:48 2026 ===  0.014766 === output
> gcc: error: unrecognized command-line option ‘-Qunused-arguments’
Wed Aug 12 05:54:48 2026 ===  0.000413 === int32/portable3/works.c compiler exited 1
Wed Aug 12 05:54:48 2026 ===  0.004763 === int32/portable4 compiling gcc -fPIC -Wall -fomit-frame-pointer -fwrapv -O3
Wed Aug 12 05:54:48 2026 ===  0.000132 === int32/portable4/sort.c compiling
Wed Aug 12 05:54:48 2026 ===  0.128569 === int32/portable4/compiler.c compiling
Wed Aug 12 05:54:48 2026 ===  0.031676 === int32/portable4/version.c compiling
Wed Aug 12 05:54:48 2026 ===  0.031858 === int32/portable4/implementation.c compiling
Wed Aug 12 05:54:48 2026 ===  0.031623 === int32/portable4/cycles.c compiling
Wed Aug 12 05:54:48 2026 ===  0.096705 === int32/portable4/works.c compiling
Wed Aug 12 05:54:48 2026 ===  0.261662 === int32/portable4 compiled gcc -fPIC -Wall -fomit-frame-pointer -fwrapv -O3
Wed Aug 12 05:54:48 2026 ===  0.018654 === int32/portable4 compiling gcc -fPIC -Wall -fomit-frame-pointer -fwrapv -march=core-avx2 -O3
Wed Aug 12 05:54:48 2026 ===  0.000257 === int32/portable4/sort.c compiling
Wed Aug 12 05:54:48 2026 ===  0.130119 === int32/portable4/compiler.c compiling
Wed Aug 12 05:54:48 2026 ===  0.030748 === int32/portable4/version.c compiling
Wed Aug 12 05:54:48 2026 ===  0.030578 === int32/portable4/implementation.c compiling
Wed Aug 12 05:54:48 2026 ===  0.031618 === int32/portable4/cycles.c compiling
Wed Aug 12 05:54:49 2026 ===  0.132575 === int32/portable4/works.c compiling
Wed Aug 12 05:54:49 2026 ===  0.304106 === int32/portable4 compiled gcc -fPIC -Wall -fomit-frame-pointer -fwrapv -march=core-avx2 -O3
Wed Aug 12 05:54:49 2026 ===  0.018455 === int32/portable4 compiling clang -fPIC -Wall -fomit-frame-pointer -fwrapv -Qunused-arguments -O3
Wed Aug 12 05:54:49 2026 ===  0.000234 === int32/portable4/sort.c compiling
Wed Aug 12 05:54:49 2026 ===  0.012592 === output
> gcc: error: unrecognized command-line option ‘-Qunused-arguments’
Wed Aug 12 05:54:49 2026 ===  0.000324 === int32/portable4/sort.c compiler exited 1
Wed Aug 12 05:54:49 2026 ===  0.000083 === int32/portable4/compiler.c compiling
Wed Aug 12 05:54:49 2026 ===  0.013130 === output
> gcc: error: unrecognized command-line option ‘-Qunused-arguments’
Wed Aug 12 05:54:49 2026 ===  0.000458 === int32/portable4/compiler.c compiler exited 1
Wed Aug 12 05:54:49 2026 ===  0.000111 === int32/portable4/version.c compiling
Wed Aug 12 05:54:49 2026 ===  0.015790 === output
> gcc: error: unrecognized command-line option ‘-Qunused-arguments’
Wed Aug 12 05:54:49 2026 ===  0.000480 === int32/portable4/version.c compiler exited 1
Wed Aug 12 05:54:49 2026 ===  0.000075 === int32/portable4/implementation.c compiling
Wed Aug 12 05:54:49 2026 ===  0.011662 === output
> gcc: error: unrecognized command-line option ‘-Qunused-arguments’
Wed Aug 12 05:54:49 2026 ===  0.000314 === int32/portable4/implementation.c compiler exited 1
Wed Aug 12 05:54:49 2026 ===  0.000077 === int32/portable4/cycles.c compiling
Wed Aug 12 05:54:49 2026 ===  0.014445 === output
> gcc: error: unrecognized command-line option ‘-Qunused-arguments’
Wed Aug 12 05:54:49 2026 ===  0.001407 === int32/portable4/cycles.c compiler exited 1
Wed Aug 12 05:54:49 2026 ===  0.000085 === int32/portable4/works.c compiling
Wed Aug 12 05:54:49 2026 ===  0.013915 === output
> gcc: error: unrecognized command-line option ‘-Qunused-arguments’
Wed Aug 12 05:54:49 2026 ===  0.000833 === int32/portable4/works.c compiler exited 1
Wed Aug 12 05:54:49 2026 ===  0.000144 === int32/portable4 compiling clang -fPIC -Wall -fomit-frame-pointer -fwrapv -Qunused-arguments -mavx2 -O3
Wed Aug 12 05:54:49 2026 ===  0.000207 === int32/portable4/sort.c compiling
Wed Aug 12 05:54:49 2026 ===  0.015147 === output
> gcc: error: unrecognized command-line option ‘-Qunused-arguments’
Wed Aug 12 05:54:49 2026 ===  0.000293 === int32/portable4/sort.c compiler exited 1
Wed Aug 12 05:54:49 2026 ===  0.000080 === int32/portable4/compiler.c compiling
Wed Aug 12 05:54:49 2026 ===  0.014705 === output
> gcc: error: unrecognized command-line option ‘-Qunused-arguments’
Wed Aug 12 05:54:49 2026 ===  0.000382 === int32/portable4/compiler.c compiler exited 1
Wed Aug 12 05:54:49 2026 ===  0.000087 === int32/portable4/version.c compiling
Wed Aug 12 05:54:49 2026 ===  0.014999 === output
> gcc: error: unrecognized command-line option ‘-Qunused-arguments’
Wed Aug 12 05:54:49 2026 ===  0.000440 === int32/portable4/version.c compiler exited 1
Wed Aug 12 05:54:49 2026 ===  0.000075 === int32/portable4/implementation.c compiling
Wed Aug 12 05:54:49 2026 ===  0.015057 === output
> gcc: error: unrecognized command-line option ‘-Qunused-arguments’
Wed Aug 12 05:54:49 2026 ===  0.000436 === int32/portable4/implementation.c compiler exited 1
Wed Aug 12 05:54:49 2026 ===  0.000119 === int32/portable4/cycles.c compiling
Wed Aug 12 05:54:49 2026 ===  0.012866 === output
> gcc: error: unrecognized command-line option ‘-Qunused-arguments’
Wed Aug 12 05:54:49 2026 ===  0.000417 === int32/portable4/cycles.c compiler exited 1
Wed Aug 12 05:54:49 2026 ===  0.000120 === int32/portable4/works.c compiling
Wed Aug 12 05:54:49 2026 ===  0.016062 === output
> gcc: error: unrecognized command-line option ‘-Qunused-arguments’
Wed Aug 12 05:54:49 2026 ===  0.000369 === int32/portable4/works.c compiler exited 1
Wed Aug 12 05:54:49 2026 ===  0.001323 === uint32/useint32 compiling gcc -fPIC -Wall -fomit-frame-pointer -fwrapv -O3
Wed Aug 12 05:54:49 2026 ===  0.000111 === uint32/useint32/sort.c compiling
Wed Aug 12 05:54:49 2026 ===  0.050480 === uint32/useint32/compiler.c compiling
Wed Aug 12 05:54:49 2026 ===  0.033137 === uint32/useint32/version.c compiling
Wed Aug 12 05:54:49 2026 ===  0.029466 === uint32/useint32/implementation.c compiling
Wed Aug 12 05:54:49 2026 ===  0.029176 === uint32/useint32/cycles.c compiling
Wed Aug 12 05:54:49 2026 ===  0.081833 === uint32/useint32/works.c compiling
Wed Aug 12 05:54:49 2026 ===  0.104839 === uint32/useint32 compiled gcc -fPIC -Wall -fomit-frame-pointer -fwrapv -O3
Wed Aug 12 05:54:49 2026 ===  0.019007 === uint32/useint32 compiling gcc -fPIC -Wall -fomit-frame-pointer -fwrapv -march=core-avx2 -O3
Wed Aug 12 05:54:49 2026 ===  0.000273 === uint32/useint32/sort.c compiling
Wed Aug 12 05:54:49 2026 ===  0.059602 === uint32/useint32/compiler.c compiling
Wed Aug 12 05:54:49 2026 ===  0.034196 === uint32/useint32/version.c compiling
Wed Aug 12 05:54:50 2026 ===  0.032193 === uint32/useint32/implementation.c compiling
Wed Aug 12 05:54:50 2026 ===  0.032344 === uint32/useint32/cycles.c compiling
Wed Aug 12 05:54:50 2026 ===  0.130062 === uint32/useint32/works.c compiling
Wed Aug 12 05:54:50 2026 ===  0.110685 === uint32/useint32 compiled gcc -fPIC -Wall -fomit-frame-pointer -fwrapv -march=core-avx2 -O3
Wed Aug 12 05:54:50 2026 ===  0.018495 === uint32/useint32 compiling clang -fPIC -Wall -fomit-frame-pointer -fwrapv -Qunused-arguments -O3
Wed Aug 12 05:54:50 2026 ===  0.000254 === uint32/useint32/sort.c compiling
Wed Aug 12 05:54:50 2026 ===  0.014615 === output
> gcc: error: unrecognized command-line option ‘-Qunused-arguments’
Wed Aug 12 05:54:50 2026 ===  0.000433 === uint32/useint32/sort.c compiler exited 1
Wed Aug 12 05:54:50 2026 ===  0.000111 === uint32/useint32/compiler.c compiling
Wed Aug 12 05:54:50 2026 ===  0.015775 === output
> gcc: error: unrecognized command-line option ‘-Qunused-arguments’
Wed Aug 12 05:54:50 2026 ===  0.000401 === uint32/useint32/compiler.c compiler exited 1
Wed Aug 12 05:54:50 2026 ===  0.000104 === uint32/useint32/version.c compiling
Wed Aug 12 05:54:50 2026 ===  0.013861 === output
> gcc: error: unrecognized command-line option ‘-Qunused-arguments’
Wed Aug 12 05:54:50 2026 ===  0.000439 === uint32/useint32/version.c compiler exited 1
Wed Aug 12 05:54:50 2026 ===  0.000108 === uint32/useint32/implementation.c compiling
Wed Aug 12 05:54:50 2026 ===  0.014464 === output
> gcc: error: unrecognized command-line option ‘-Qunused-arguments’
Wed Aug 12 05:54:50 2026 ===  0.000411 === uint32/useint32/implementation.c compiler exited 1
Wed Aug 12 05:54:50 2026 ===  0.000103 === uint32/useint32/cycles.c compiling
Wed Aug 12 05:54:50 2026 ===  0.013722 === output
> gcc: error: unrecognized command-line option ‘-Qunused-arguments’
Wed Aug 12 05:54:50 2026 ===  0.000401 === uint32/useint32/cycles.c compiler exited 1
Wed Aug 12 05:54:50 2026 ===  0.000105 === uint32/useint32/works.c compiling
Wed Aug 12 05:54:50 2026 ===  0.013963 === output
> gcc: error: unrecognized command-line option ‘-Qunused-arguments’
Wed Aug 12 05:54:50 2026 ===  0.000435 === uint32/useint32/works.c compiler exited 1
Wed Aug 12 05:54:50 2026 ===  0.000124 === uint32/useint32 compiling clang -fPIC -Wall -fomit-frame-pointer -fwrapv -Qunused-arguments -mavx2 -O3
Wed Aug 12 05:54:50 2026 ===  0.000221 === uint32/useint32/sort.c compiling
Wed Aug 12 05:54:50 2026 ===  0.014658 === output
> gcc: error: unrecognized command-line option ‘-Qunused-arguments’
Wed Aug 12 05:54:50 2026 ===  0.000447 === uint32/useint32/sort.c compiler exited 1
Wed Aug 12 05:54:50 2026 ===  0.000119 === uint32/useint32/compiler.c compiling
Wed Aug 12 05:54:50 2026 ===  0.013866 === output
> gcc: error: unrecognized command-line option ‘-Qunused-arguments’
Wed Aug 12 05:54:50 2026 ===  0.000430 === uint32/useint32/compiler.c compiler exited 1
Wed Aug 12 05:54:50 2026 ===  0.000118 === uint32/useint32/version.c compiling
Wed Aug 12 05:54:50 2026 ===  0.013128 === output
> gcc: error: unrecognized command-line option ‘-Qunused-arguments’
Wed Aug 12 05:54:50 2026 ===  0.000377 === uint32/useint32/version.c compiler exited 1
Wed Aug 12 05:54:50 2026 ===  0.000098 === uint32/useint32/implementation.c compiling
Wed Aug 12 05:54:50 2026 ===  0.014093 === output
> gcc: error: unrecognized command-line option ‘-Qunused-arguments’
Wed Aug 12 05:54:50 2026 ===  0.000398 === uint32/useint32/implementation.c compiler exited 1
Wed Aug 12 05:54:50 2026 ===  0.000101 === uint32/useint32/cycles.c compiling
Wed Aug 12 05:54:50 2026 ===  0.014162 === output
> gcc: error: unrecognized command-line option ‘-Qunused-arguments’
Wed Aug 12 05:54:50 2026 ===  0.000401 === uint32/useint32/cycles.c compiler exited 1
Wed Aug 12 05:54:50 2026 ===  0.000105 === uint32/useint32/works.c compiling
Wed Aug 12 05:54:50 2026 ===  0.014704 === output
> gcc: error: unrecognized command-line option ‘-Qunused-arguments’
Wed Aug 12 05:54:50 2026 ===  0.000427 === uint32/useint32/works.c compiler exited 1
Wed Aug 12 05:54:50 2026 ===  0.001603 === float32/useint32 compiling gcc -fPIC -Wall -fomit-frame-pointer -fwrapv -O3
Wed Aug 12 05:54:50 2026 ===  0.000135 === float32/useint32/sort.c compiling
Wed Aug 12 05:54:50 2026 ===  0.066540 === float32/useint32/compiler.c compiling
Wed Aug 12 05:54:50 2026 ===  0.025478 === float32/useint32/version.c compiling
Wed Aug 12 05:54:50 2026 ===  0.026273 === float32/useint32/implementation.c compiling
Wed Aug 12 05:54:50 2026 ===  0.029754 === float32/useint32/cycles.c compiling
Wed Aug 12 05:54:50 2026 ===  0.072743 === float32/useint32/works.c compiling
Wed Aug 12 05:54:50 2026 ===  0.088165 === float32/useint32 compiled gcc -fPIC -Wall -fomit-frame-pointer -fwrapv -O3
Wed Aug 12 05:54:50 2026 ===  0.019143 === float32/useint32 compiling gcc -fPIC -Wall -fomit-frame-pointer -fwrapv -march=core-avx2 -O3
Wed Aug 12 05:54:50 2026 ===  0.000275 === float32/useint32/sort.c compiling
Wed Aug 12 05:54:50 2026 ===  0.058393 === float32/useint32/compiler.c compiling
Wed Aug 12 05:54:50 2026 ===  0.075326 === float32/useint32/version.c compiling
Wed Aug 12 05:54:50 2026 ===  0.030140 === float32/useint32/implementation.c compiling
Wed Aug 12 05:54:51 2026 ===  0.031461 === float32/useint32/cycles.c compiling
Wed Aug 12 05:54:51 2026 ===  0.105621 === float32/useint32/works.c compiling
Wed Aug 12 05:54:51 2026 ===  0.084518 === float32/useint32 compiled gcc -fPIC -Wall -fomit-frame-pointer -fwrapv -march=core-avx2 -O3
Wed Aug 12 05:54:51 2026 ===  0.018907 === float32/useint32 compiling clang -fPIC -Wall -fomit-frame-pointer -fwrapv -Qunused-arguments -O3
Wed Aug 12 05:54:51 2026 ===  0.000283 === float32/useint32/sort.c compiling
Wed Aug 12 05:54:51 2026 ===  0.016784 === output
> gcc: error: unrecognized command-line option ‘-Qunused-arguments’
Wed Aug 12 05:54:51 2026 ===  0.000501 === float32/useint32/sort.c compiler exited 1
Wed Aug 12 05:54:51 2026 ===  0.000134 === float32/useint32/compiler.c compiling
Wed Aug 12 05:54:51 2026 ===  0.016456 === output
> gcc: error: unrecognized command-line option ‘-Qunused-arguments’
Wed Aug 12 05:54:51 2026 ===  0.000484 === float32/useint32/compiler.c compiler exited 1
Wed Aug 12 05:54:51 2026 ===  0.000118 === float32/useint32/version.c compiling
Wed Aug 12 05:54:51 2026 ===  0.011655 === output
> gcc: error: unrecognized command-line option ‘-Qunused-arguments’
Wed Aug 12 05:54:51 2026 ===  0.000460 === float32/useint32/version.c compiler exited 1
Wed Aug 12 05:54:51 2026 ===  0.000113 === float32/useint32/implementation.c compiling
Wed Aug 12 05:54:51 2026 ===  0.015255 === output
> gcc: error: unrecognized command-line option ‘-Qunused-arguments’
Wed Aug 12 05:54:51 2026 ===  0.000429 === float32/useint32/implementation.c compiler exited 1
Wed Aug 12 05:54:51 2026 ===  0.000105 === float32/useint32/cycles.c compiling
Wed Aug 12 05:54:51 2026 ===  0.017308 === output
> gcc: error: unrecognized command-line option ‘-Qunused-arguments’
Wed Aug 12 05:54:51 2026 ===  0.000443 === float32/useint32/cycles.c compiler exited 1
Wed Aug 12 05:54:51 2026 ===  0.000121 === float32/useint32/works.c compiling
Wed Aug 12 05:54:51 2026 ===  0.016325 === output
> gcc: error: unrecognized command-line option ‘-Qunused-arguments’
Wed Aug 12 05:54:51 2026 ===  0.000346 === float32/useint32/works.c compiler exited 1
Wed Aug 12 05:54:51 2026 ===  0.000089 === float32/useint32 compiling clang -fPIC -Wall -fomit-frame-pointer -fwrapv -Qunused-arguments -mavx2 -O3
Wed Aug 12 05:54:51 2026 ===  0.000142 === float32/useint32/sort.c compiling
Wed Aug 12 05:54:51 2026 ===  0.029908 === output
> gcc: error: unrecognized command-line option ‘-Qunused-arguments’
Wed Aug 12 05:54:51 2026 ===  0.000370 === float32/useint32/sort.c compiler exited 1
Wed Aug 12 05:54:51 2026 ===  0.000094 === float32/useint32/compiler.c compiling
Wed Aug 12 05:54:51 2026 ===  0.015451 === output
> gcc: error: unrecognized command-line option ‘-Qunused-arguments’
Wed Aug 12 05:54:51 2026 ===  0.000348 === float32/useint32/compiler.c compiler exited 1
Wed Aug 12 05:54:51 2026 ===  0.000084 === float32/useint32/version.c compiling
Wed Aug 12 05:54:51 2026 ===  0.016357 === output
> gcc: error: unrecognized command-line option ‘-Qunused-arguments’
Wed Aug 12 05:54:51 2026 ===  0.000448 === float32/useint32/version.c compiler exited 1
Wed Aug 12 05:54:51 2026 ===  0.000099 === float32/useint32/implementation.c compiling
Wed Aug 12 05:54:51 2026 ===  0.015002 === output
> gcc: error: unrecognized command-line option ‘-Qunused-arguments’
Wed Aug 12 05:54:51 2026 ===  0.000607 === float32/useint32/implementation.c compiler exited 1
Wed Aug 12 05:54:51 2026 ===  0.000117 === float32/useint32/cycles.c compiling
Wed Aug 12 05:54:51 2026 ===  0.017793 === output
> gcc: error: unrecognized command-line option ‘-Qunused-arguments’
Wed Aug 12 05:54:51 2026 ===  0.000415 === float32/useint32/cycles.c compiler exited 1
Wed Aug 12 05:54:51 2026 ===  0.000099 === float32/useint32/works.c compiling
Wed Aug 12 05:54:51 2026 ===  0.014723 === output
> gcc: error: unrecognized command-line option ‘-Qunused-arguments’
Wed Aug 12 05:54:51 2026 ===  0.000556 === float32/useint32/works.c compiler exited 1
Wed Aug 12 05:54:51 2026 ===  0.000123 === command/limits.c compiling gcc -fPIC -Wall -fomit-frame-pointer -fwrapv -O3
Wed Aug 12 05:54:51 2026 ===  0.056916 === command/limits.c compiling gcc -fPIC -Wall -fomit-frame-pointer -fwrapv -march=core-avx2 -O3
Wed Aug 12 05:54:51 2026 ===  0.051030 === command/limits.c compiling clang -fPIC -Wall -fomit-frame-pointer -fwrapv -Qunused-arguments -O3
Wed Aug 12 05:54:51 2026 ===  0.015175 === output
> gcc: error: unrecognized command-line option ‘-Qunused-arguments’
Wed Aug 12 05:54:51 2026 ===  0.000462 === command/limits.c compiler exited 1
Wed Aug 12 05:54:51 2026 ===  0.000087 === command/limits.c compiling clang -fPIC -Wall -fomit-frame-pointer -fwrapv -Qunused-arguments -mavx2 -O3
Wed Aug 12 05:54:51 2026 ===  0.014110 === output
> gcc: error: unrecognized command-line option ‘-Qunused-arguments’
Wed Aug 12 05:54:51 2026 ===  0.000385 === command/limits.c compiler exited 1
Wed Aug 12 05:54:51 2026 ===  0.001107 === command/int32-speed.c compiling gcc -fPIC -Wall -fomit-frame-pointer -fwrapv -O3
Wed Aug 12 05:54:51 2026 ===  0.093087 === command/int32-speed.c compiling gcc -fPIC -Wall -fomit-frame-pointer -fwrapv -march=core-avx2 -O3
Wed Aug 12 05:54:51 2026 ===  0.087867 === command/int32-speed.c compiling clang -fPIC -Wall -fomit-frame-pointer -fwrapv -Qunused-arguments -O3
Wed Aug 12 05:54:51 2026 ===  0.015278 === output
> gcc: error: unrecognized command-line option ‘-Qunused-arguments’
Wed Aug 12 05:54:51 2026 ===  0.000451 === command/int32-speed.c compiler exited 1
Wed Aug 12 05:54:51 2026 ===  0.000119 === command/int32-speed.c compiling clang -fPIC -Wall -fomit-frame-pointer -fwrapv -Qunused-arguments -mavx2 -O3
Wed Aug 12 05:54:51 2026 ===  0.016722 === output
> gcc: error: unrecognized command-line option ‘-Qunused-arguments’
Wed Aug 12 05:54:51 2026 ===  0.000447 === command/int32-speed.c compiler exited 1
Wed Aug 12 05:54:51 2026 ===  0.000737 === command/uint32-speed.c compiling gcc -fPIC -Wall -fomit-frame-pointer -fwrapv -O3
Wed Aug 12 05:54:51 2026 ===  0.086017 === command/uint32-speed.c compiling gcc -fPIC -Wall -fomit-frame-pointer -fwrapv -march=core-avx2 -O3
Wed Aug 12 05:54:51 2026 ===  0.092884 === command/uint32-speed.c compiling clang -fPIC -Wall -fomit-frame-pointer -fwrapv -Qunused-arguments -O3
Wed Aug 12 05:54:51 2026 ===  0.015613 === output
> gcc: error: unrecognized command-line option ‘-Qunused-arguments’
Wed Aug 12 05:54:51 2026 ===  0.000429 === command/uint32-speed.c compiler exited 1
Wed Aug 12 05:54:51 2026 ===  0.000073 === command/uint32-speed.c compiling clang -fPIC -Wall -fomit-frame-pointer -fwrapv -Qunused-arguments -mavx2 -O3
Wed Aug 12 05:54:51 2026 ===  0.014892 === output
> gcc: error: unrecognized command-line option ‘-Qunused-arguments’
Wed Aug 12 05:54:51 2026 ===  0.000570 === command/uint32-speed.c compiler exited 1
Wed Aug 12 05:54:51 2026 ===  0.000715 === command/float32-speed.c compiling gcc -fPIC -Wall -fomit-frame-pointer -fwrapv -O3
Wed Aug 12 05:54:52 2026 ===  0.078109 === command/float32-speed.c compiling gcc -fPIC -Wall -fomit-frame-pointer -fwrapv -march=core-avx2 -O3
Wed Aug 12 05:54:52 2026 ===  0.095225 === command/float32-speed.c compiling clang -fPIC -Wall -fomit-frame-pointer -fwrapv -Qunused-arguments -O3
Wed Aug 12 05:54:52 2026 ===  0.015368 === output
> gcc: error: unrecognized command-line option ‘-Qunused-arguments’
Wed Aug 12 05:54:52 2026 ===  0.000385 === command/float32-speed.c compiler exited 1
Wed Aug 12 05:54:52 2026 ===  0.000087 === command/float32-speed.c compiling clang -fPIC -Wall -fomit-frame-pointer -fwrapv -Qunused-arguments -mavx2 -O3
Wed Aug 12 05:54:52 2026 ===  0.014953 === output
> gcc: error: unrecognized command-line option ‘-Qunused-arguments’
Wed Aug 12 05:54:52 2026 ===  0.000363 === command/float32-speed.c compiler exited 1
Wed Aug 12 05:54:52 2026 ===  0.000261 === build finishing successfully
