Mon Aug 10 07:41:43 2026 ===  0.000000 === build starting
Mon Aug 10 07:41:43 2026 ===  0.000064 === version 20190516
Mon Aug 10 07:41:43 2026 ===  0.000027 === hostname pkgsrchostname
Mon Aug 10 07:41:43 2026 ===  0.000204 === compilers/abiname.c compiling gcc -fPIC -Wall -fomit-frame-pointer -fwrapv -O3
Mon Aug 10 07:41:43 2026 ===  0.219687 === compilers/abiname.c compiling gcc -fPIC -Wall -fomit-frame-pointer -fwrapv -march=core-avx2 -O3
Mon Aug 10 07:41:43 2026 ===  0.347843 === compilers/abiname.c compiling clang -fPIC -Wall -fomit-frame-pointer -fwrapv -Qunused-arguments -O3
Mon Aug 10 07:41:43 2026 ===  0.022836 === output
> gcc: error: unrecognized command-line option ‘-Qunused-arguments’
Mon Aug 10 07:41:43 2026 ===  0.000517 === compilers/abiname.c compiler exited 1
Mon Aug 10 07:41:43 2026 ===  0.024403 === output
> gcc: error: unrecognized command-line option ‘-Qunused-arguments’
Mon Aug 10 07:41:43 2026 ===  0.000455 === compilers/base.c compiler exited 1
Mon Aug 10 07:41:43 2026 ===  0.008431 === compilers/abiname.c compiling clang -fPIC -Wall -fomit-frame-pointer -fwrapv -Qunused-arguments -mavx2 -O3
Mon Aug 10 07:41:43 2026 ===  0.022761 === output
> gcc: error: unrecognized command-line option ‘-Qunused-arguments’
Mon Aug 10 07:41:43 2026 ===  0.000421 === compilers/abiname.c compiler exited 1
Mon Aug 10 07:41:43 2026 ===  0.025421 === output
> gcc: error: unrecognized command-line option ‘-Qunused-arguments’
Mon Aug 10 07:41:43 2026 ===  0.000474 === compilers/base.c compiler exited 1
Mon Aug 10 07:41:43 2026 ===  0.007255 === cpucycles/amd64cpuinfo compiling gcc -fPIC -Wall -fomit-frame-pointer -fwrapv -O3
Mon Aug 10 07:41:44 2026 ===  0.228657 === cpucycles/amd64cpuinfo compiling gcc -fPIC -Wall -fomit-frame-pointer -fwrapv -march=core-avx2 -O3
Mon Aug 10 07:41:44 2026 ===  0.216347 === cpucycles/amd64cpuinfo compiling clang -fPIC -Wall -fomit-frame-pointer -fwrapv -Qunused-arguments -O3
Mon Aug 10 07:41:44 2026 ===  0.024091 === output
> gcc: error: unrecognized command-line option ‘-Qunused-arguments’
Mon Aug 10 07:41:44 2026 ===  0.000391 === cpucycles/cpucycles.c compiler exited 1
Mon Aug 10 07:41:44 2026 ===  0.000221 === cpucycles/amd64cpuinfo compiling clang -fPIC -Wall -fomit-frame-pointer -fwrapv -Qunused-arguments -mavx2 -O3
Mon Aug 10 07:41:44 2026 ===  0.024827 === output
> gcc: error: unrecognized command-line option ‘-Qunused-arguments’
Mon Aug 10 07:41:44 2026 ===  0.000424 === cpucycles/cpucycles.c compiler exited 1
Mon Aug 10 07:41:44 2026 ===  0.000266 === cpucycles/amd64cpuspeed compiling gcc -fPIC -Wall -fomit-frame-pointer -fwrapv -O3
Mon Aug 10 07:41:44 2026 ===  0.044494 === output
> cpucycles.c: In function ‘djbsort_cpucycles_persecond’:
> cpucycles.c:21:12: error: ‘HW_CPUSPEED’ undeclared (first use in this function)
>    21 |   oid[1] = HW_CPUSPEED;
>       |            ^~~~~~~~~~~
> cpucycles.c:21:12: note: each undeclared identifier is reported only once for each function it appears in
Mon Aug 10 07:41:44 2026 ===  0.000441 === cpucycles/cpucycles.c compiler exited 1
Mon Aug 10 07:41:44 2026 ===  0.000238 === cpucycles/amd64cpuspeed compiling gcc -fPIC -Wall -fomit-frame-pointer -fwrapv -march=core-avx2 -O3
Mon Aug 10 07:41:44 2026 ===  0.050426 === output
> cpucycles.c: In function ‘djbsort_cpucycles_persecond’:
> cpucycles.c:21:12: error: ‘HW_CPUSPEED’ undeclared (first use in this function)
>    21 |   oid[1] = HW_CPUSPEED;
>       |            ^~~~~~~~~~~
> cpucycles.c:21:12: note: each undeclared identifier is reported only once for each function it appears in
Mon Aug 10 07:41:44 2026 ===  0.000445 === cpucycles/cpucycles.c compiler exited 1
Mon Aug 10 07:41:44 2026 ===  0.000229 === cpucycles/amd64cpuspeed compiling clang -fPIC -Wall -fomit-frame-pointer -fwrapv -Qunused-arguments -O3
Mon Aug 10 07:41:44 2026 ===  0.028139 === output
> gcc: error: unrecognized command-line option ‘-Qunused-arguments’
Mon Aug 10 07:41:44 2026 ===  0.000384 === cpucycles/cpucycles.c compiler exited 1
Mon Aug 10 07:41:44 2026 ===  0.000223 === cpucycles/amd64cpuspeed compiling clang -fPIC -Wall -fomit-frame-pointer -fwrapv -Qunused-arguments -mavx2 -O3
Mon Aug 10 07:41:44 2026 ===  0.028498 === output
> gcc: error: unrecognized command-line option ‘-Qunused-arguments’
Mon Aug 10 07:41:44 2026 ===  0.000400 === cpucycles/cpucycles.c compiler exited 1
Mon Aug 10 07:41:44 2026 ===  0.000251 === cpucycles/amd64tscfreq compiling gcc -fPIC -Wall -fomit-frame-pointer -fwrapv -O3
Mon Aug 10 07:41:44 2026 ===  0.060029 === output
> cpucycles.c: In function ‘djbsort_cpucycles_persecond’:
> cpucycles.c:17:3: warning: implicit declaration of function ‘sysctlbyname’ [-Wimplicit-function-declaration]
>    17 |   sysctlbyname("machdep.tsc_freq",&result,&resultlen,0,0);
>       |   ^~~~~~~~~~~~
Mon Aug 10 07:41:44 2026 ===  0.236340 === cpucycles/amd64tscfreq compiling gcc -fPIC -Wall -fomit-frame-pointer -fwrapv -march=core-avx2 -O3
Mon Aug 10 07:41:44 2026 ===  0.062163 === output
> cpucycles.c: In function ‘djbsort_cpucycles_persecond’:
> cpucycles.c:17:3: warning: implicit declaration of function ‘sysctlbyname’ [-Wimplicit-function-declaration]
>    17 |   sysctlbyname("machdep.tsc_freq",&result,&resultlen,0,0);
>       |   ^~~~~~~~~~~~
Mon Aug 10 07:41:45 2026 ===  0.232003 === cpucycles/amd64tscfreq compiling clang -fPIC -Wall -fomit-frame-pointer -fwrapv -Qunused-arguments -O3
Mon Aug 10 07:41:45 2026 ===  0.023591 === output
> gcc: error: unrecognized command-line option ‘-Qunused-arguments’
Mon Aug 10 07:41:45 2026 ===  0.000636 === cpucycles/cpucycles.c compiler exited 1
Mon Aug 10 07:41:45 2026 ===  0.001506 === cpucycles/amd64tscfreq compiling clang -fPIC -Wall -fomit-frame-pointer -fwrapv -Qunused-arguments -mavx2 -O3
Mon Aug 10 07:41:45 2026 ===  0.024318 === output
> gcc: error: unrecognized command-line option ‘-Qunused-arguments’
Mon Aug 10 07:41:45 2026 ===  0.000401 === cpucycles/cpucycles.c compiler exited 1
Mon Aug 10 07:41:45 2026 ===  0.000100 === cpucycles/apple compiling gcc -fPIC -Wall -fomit-frame-pointer -fwrapv -O3
Mon Aug 10 07:41:45 2026 ===  0.045432 === output
> cpucycles.c:6:10: fatal error: mach/mach_time.h: No such file or directory
>     6 | #include <mach/mach_time.h>
>       |          ^~~~~~~~~~~~~~~~~~
> compilation terminated.
Mon Aug 10 07:41:45 2026 ===  0.000406 === cpucycles/cpucycles.c compiler exited 1
Mon Aug 10 07:41:45 2026 ===  0.000114 === cpucycles/apple compiling gcc -fPIC -Wall -fomit-frame-pointer -fwrapv -march=core-avx2 -O3
Mon Aug 10 07:41:45 2026 ===  0.043876 === output
> cpucycles.c:6:10: fatal error: mach/mach_time.h: No such file or directory
>     6 | #include <mach/mach_time.h>
>       |          ^~~~~~~~~~~~~~~~~~
> compilation terminated.
Mon Aug 10 07:41:45 2026 ===  0.000436 === cpucycles/cpucycles.c compiler exited 1
Mon Aug 10 07:41:45 2026 ===  0.000113 === cpucycles/apple compiling clang -fPIC -Wall -fomit-frame-pointer -fwrapv -Qunused-arguments -O3
Mon Aug 10 07:41:45 2026 ===  0.024330 === output
> gcc: error: unrecognized command-line option ‘-Qunused-arguments’
Mon Aug 10 07:41:45 2026 ===  0.000391 === cpucycles/cpucycles.c compiler exited 1
Mon Aug 10 07:41:45 2026 ===  0.000102 === cpucycles/apple compiling clang -fPIC -Wall -fomit-frame-pointer -fwrapv -Qunused-arguments -mavx2 -O3
Mon Aug 10 07:41:45 2026 ===  0.024326 === output
> gcc: error: unrecognized command-line option ‘-Qunused-arguments’
Mon Aug 10 07:41:45 2026 ===  0.000435 === cpucycles/cpucycles.c compiler exited 1
Mon Aug 10 07:41:45 2026 ===  0.000273 === cpucycles/celllinux skipping architecture gcc -fPIC -Wall -fomit-frame-pointer -fwrapv -O3
Mon Aug 10 07:41:45 2026 ===  0.000082 === cpucycles/celllinux skipping architecture gcc -fPIC -Wall -fomit-frame-pointer -fwrapv -march=core-avx2 -O3
Mon Aug 10 07:41:45 2026 ===  0.000056 === cpucycles/celllinux skipping architecture clang -fPIC -Wall -fomit-frame-pointer -fwrapv -Qunused-arguments -O3
Mon Aug 10 07:41:45 2026 ===  0.000050 === cpucycles/celllinux skipping architecture clang -fPIC -Wall -fomit-frame-pointer -fwrapv -Qunused-arguments -mavx2 -O3
Mon Aug 10 07:41:45 2026 ===  0.000102 === cpucycles/cortex skipping architecture gcc -fPIC -Wall -fomit-frame-pointer -fwrapv -O3
Mon Aug 10 07:41:45 2026 ===  0.000053 === cpucycles/cortex skipping architecture gcc -fPIC -Wall -fomit-frame-pointer -fwrapv -march=core-avx2 -O3
Mon Aug 10 07:41:45 2026 ===  0.000049 === cpucycles/cortex skipping architecture clang -fPIC -Wall -fomit-frame-pointer -fwrapv -Qunused-arguments -O3
Mon Aug 10 07:41:45 2026 ===  0.000048 === cpucycles/cortex skipping architecture clang -fPIC -Wall -fomit-frame-pointer -fwrapv -Qunused-arguments -mavx2 -O3
Mon Aug 10 07:41:45 2026 ===  0.000085 === cpucycles/cortex_vct skipping architecture gcc -fPIC -Wall -fomit-frame-pointer -fwrapv -O3
Mon Aug 10 07:41:45 2026 ===  0.000050 === cpucycles/cortex_vct skipping architecture gcc -fPIC -Wall -fomit-frame-pointer -fwrapv -march=core-avx2 -O3
Mon Aug 10 07:41:45 2026 ===  0.000046 === cpucycles/cortex_vct skipping architecture clang -fPIC -Wall -fomit-frame-pointer -fwrapv -Qunused-arguments -O3
Mon Aug 10 07:41:45 2026 ===  0.000044 === cpucycles/cortex_vct skipping architecture clang -fPIC -Wall -fomit-frame-pointer -fwrapv -Qunused-arguments -mavx2 -O3
Mon Aug 10 07:41:45 2026 ===  0.000044 === cpucycles/dev4ns compiling gcc -fPIC -Wall -fomit-frame-pointer -fwrapv -O3
Mon Aug 10 07:41:45 2026 ===  0.260302 === cpucycles/dev4ns compiling gcc -fPIC -Wall -fomit-frame-pointer -fwrapv -march=core-avx2 -O3
Mon Aug 10 07:41:45 2026 ===  0.326479 === cpucycles/dev4ns compiling clang -fPIC -Wall -fomit-frame-pointer -fwrapv -Qunused-arguments -O3
Mon Aug 10 07:41:45 2026 ===  0.024345 === output
> gcc: error: unrecognized command-line option ‘-Qunused-arguments’
Mon Aug 10 07:41:45 2026 ===  0.000369 === cpucycles/cpucycles.c compiler exited 1
Mon Aug 10 07:41:45 2026 ===  0.000086 === cpucycles/dev4ns compiling clang -fPIC -Wall -fomit-frame-pointer -fwrapv -Qunused-arguments -mavx2 -O3
Mon Aug 10 07:41:46 2026 ===  0.023649 === output
> gcc: error: unrecognized command-line option ‘-Qunused-arguments’
Mon Aug 10 07:41:46 2026 ===  0.000378 === cpucycles/cpucycles.c compiler exited 1
Mon Aug 10 07:41:46 2026 ===  0.000105 === cpucycles/gettimeofday compiling gcc -fPIC -Wall -fomit-frame-pointer -fwrapv -O3
Mon Aug 10 07:41:46 2026 ===  0.215229 === cpucycles/gettimeofday compiling gcc -fPIC -Wall -fomit-frame-pointer -fwrapv -march=core-avx2 -O3
Mon Aug 10 07:41:46 2026 ===  0.233492 === cpucycles/gettimeofday compiling clang -fPIC -Wall -fomit-frame-pointer -fwrapv -Qunused-arguments -O3
Mon Aug 10 07:41:46 2026 ===  0.025041 === output
> gcc: error: unrecognized command-line option ‘-Qunused-arguments’
Mon Aug 10 07:41:46 2026 ===  0.000439 === cpucycles/cpucycles.c compiler exited 1
Mon Aug 10 07:41:46 2026 ===  0.000120 === cpucycles/gettimeofday compiling clang -fPIC -Wall -fomit-frame-pointer -fwrapv -Qunused-arguments -mavx2 -O3
Mon Aug 10 07:41:46 2026 ===  0.024791 === output
> gcc: error: unrecognized command-line option ‘-Qunused-arguments’
Mon Aug 10 07:41:46 2026 ===  0.000429 === cpucycles/cpucycles.c compiler exited 1
Mon Aug 10 07:41:46 2026 ===  0.000283 === cpucycles/ia64cpuinfo skipping architecture gcc -fPIC -Wall -fomit-frame-pointer -fwrapv -O3
Mon Aug 10 07:41:46 2026 ===  0.000095 === cpucycles/ia64cpuinfo skipping architecture gcc -fPIC -Wall -fomit-frame-pointer -fwrapv -march=core-avx2 -O3
Mon Aug 10 07:41:46 2026 ===  0.000107 === cpucycles/ia64cpuinfo skipping architecture clang -fPIC -Wall -fomit-frame-pointer -fwrapv -Qunused-arguments -O3
Mon Aug 10 07:41:46 2026 ===  0.000081 === cpucycles/ia64cpuinfo skipping architecture clang -fPIC -Wall -fomit-frame-pointer -fwrapv -Qunused-arguments -mavx2 -O3
Mon Aug 10 07:41:46 2026 ===  0.000137 === cpucycles/mips skipping architecture gcc -fPIC -Wall -fomit-frame-pointer -fwrapv -O3
Mon Aug 10 07:41:46 2026 ===  0.000066 === cpucycles/mips skipping architecture gcc -fPIC -Wall -fomit-frame-pointer -fwrapv -march=core-avx2 -O3
Mon Aug 10 07:41:46 2026 ===  0.000062 === cpucycles/mips skipping architecture clang -fPIC -Wall -fomit-frame-pointer -fwrapv -Qunused-arguments -O3
Mon Aug 10 07:41:46 2026 ===  0.000062 === cpucycles/mips skipping architecture clang -fPIC -Wall -fomit-frame-pointer -fwrapv -Qunused-arguments -mavx2 -O3
Mon Aug 10 07:41:46 2026 ===  0.000050 === cpucycles/monotonic compiling gcc -fPIC -Wall -fomit-frame-pointer -fwrapv -O3
Mon Aug 10 07:41:46 2026 ===  0.384412 === cpucycles/monotonic compiling gcc -fPIC -Wall -fomit-frame-pointer -fwrapv -march=core-avx2 -O3
Mon Aug 10 07:41:47 2026 ===  0.482732 === cpucycles/monotonic compiling clang -fPIC -Wall -fomit-frame-pointer -fwrapv -Qunused-arguments -O3
Mon Aug 10 07:41:47 2026 ===  0.024302 === output
> gcc: error: unrecognized command-line option ‘-Qunused-arguments’
Mon Aug 10 07:41:47 2026 ===  0.000438 === cpucycles/cpucycles.c compiler exited 1
Mon Aug 10 07:41:47 2026 ===  0.000114 === cpucycles/monotonic compiling clang -fPIC -Wall -fomit-frame-pointer -fwrapv -Qunused-arguments -mavx2 -O3
Mon Aug 10 07:41:47 2026 ===  0.030519 === output
> gcc: error: unrecognized command-line option ‘-Qunused-arguments’
Mon Aug 10 07:41:47 2026 ===  0.000484 === cpucycles/cpucycles.c compiler exited 1
Mon Aug 10 07:41:47 2026 ===  0.000157 === cpucycles/monotoniccpuinfo compiling gcc -fPIC -Wall -fomit-frame-pointer -fwrapv -O3
Mon Aug 10 07:41:47 2026 ===  0.471332 === cpucycles/monotoniccpuinfo compiling gcc -fPIC -Wall -fomit-frame-pointer -fwrapv -march=core-avx2 -O3
Mon Aug 10 07:41:48 2026 ===  0.334732 === cpucycles/monotoniccpuinfo compiling clang -fPIC -Wall -fomit-frame-pointer -fwrapv -Qunused-arguments -O3
Mon Aug 10 07:41:48 2026 ===  0.024762 === output
> gcc: error: unrecognized command-line option ‘-Qunused-arguments’
Mon Aug 10 07:41:48 2026 ===  0.000515 === cpucycles/cpucycles.c compiler exited 1
Mon Aug 10 07:41:48 2026 ===  0.000215 === cpucycles/monotoniccpuinfo compiling clang -fPIC -Wall -fomit-frame-pointer -fwrapv -Qunused-arguments -mavx2 -O3
Mon Aug 10 07:41:48 2026 ===  0.025103 === output
> gcc: error: unrecognized command-line option ‘-Qunused-arguments’
Mon Aug 10 07:41:48 2026 ===  0.000467 === cpucycles/cpucycles.c compiler exited 1
Mon Aug 10 07:41:48 2026 ===  0.000174 === cpucycles/perfevent compiling gcc -fPIC -Wall -fomit-frame-pointer -fwrapv -O3
Mon Aug 10 07:41:48 2026 ===  0.036415 === output
> cpucycles.c:6:10: fatal error: linux/perf_event.h: No such file or directory
>     6 | #include <linux/perf_event.h>
>       |          ^~~~~~~~~~~~~~~~~~~~
> compilation terminated.
Mon Aug 10 07:41:48 2026 ===  0.000416 === cpucycles/cpucycles.c compiler exited 1
Mon Aug 10 07:41:48 2026 ===  0.000096 === cpucycles/perfevent compiling gcc -fPIC -Wall -fomit-frame-pointer -fwrapv -march=core-avx2 -O3
Mon Aug 10 07:41:48 2026 ===  0.034685 === output
> cpucycles.c:6:10: fatal error: linux/perf_event.h: No such file or directory
>     6 | #include <linux/perf_event.h>
>       |          ^~~~~~~~~~~~~~~~~~~~
> compilation terminated.
Mon Aug 10 07:41:48 2026 ===  0.000393 === cpucycles/cpucycles.c compiler exited 1
Mon Aug 10 07:41:48 2026 ===  0.000094 === cpucycles/perfevent compiling clang -fPIC -Wall -fomit-frame-pointer -fwrapv -Qunused-arguments -O3
Mon Aug 10 07:41:48 2026 ===  0.025491 === output
> gcc: error: unrecognized command-line option ‘-Qunused-arguments’
Mon Aug 10 07:41:48 2026 ===  0.000384 === cpucycles/cpucycles.c compiler exited 1
Mon Aug 10 07:41:48 2026 ===  0.000089 === cpucycles/perfevent compiling clang -fPIC -Wall -fomit-frame-pointer -fwrapv -Qunused-arguments -mavx2 -O3
Mon Aug 10 07:41:48 2026 ===  0.022597 === output
> gcc: error: unrecognized command-line option ‘-Qunused-arguments’
Mon Aug 10 07:41:48 2026 ===  0.000434 === cpucycles/cpucycles.c compiler exited 1
Mon Aug 10 07:41:48 2026 ===  0.000295 === cpucycles/powerpccpuinfo skipping architecture gcc -fPIC -Wall -fomit-frame-pointer -fwrapv -O3
Mon Aug 10 07:41:48 2026 ===  0.000084 === cpucycles/powerpccpuinfo skipping architecture gcc -fPIC -Wall -fomit-frame-pointer -fwrapv -march=core-avx2 -O3
Mon Aug 10 07:41:48 2026 ===  0.000059 === cpucycles/powerpccpuinfo skipping architecture clang -fPIC -Wall -fomit-frame-pointer -fwrapv -Qunused-arguments -O3
Mon Aug 10 07:41:48 2026 ===  0.000060 === cpucycles/powerpccpuinfo skipping architecture clang -fPIC -Wall -fomit-frame-pointer -fwrapv -Qunused-arguments -mavx2 -O3
Mon Aug 10 07:41:48 2026 ===  0.000086 === cpucycles/powerpcmacos skipping architecture gcc -fPIC -Wall -fomit-frame-pointer -fwrapv -O3
Mon Aug 10 07:41:48 2026 ===  0.000055 === cpucycles/powerpcmacos skipping architecture gcc -fPIC -Wall -fomit-frame-pointer -fwrapv -march=core-avx2 -O3
Mon Aug 10 07:41:48 2026 ===  0.000058 === cpucycles/powerpcmacos skipping architecture clang -fPIC -Wall -fomit-frame-pointer -fwrapv -Qunused-arguments -O3
Mon Aug 10 07:41:48 2026 ===  0.000051 === cpucycles/powerpcmacos skipping architecture clang -fPIC -Wall -fomit-frame-pointer -fwrapv -Qunused-arguments -mavx2 -O3
Mon Aug 10 07:41:48 2026 ===  0.000094 === cpucycles/sparc32cpuinfo skipping architecture gcc -fPIC -Wall -fomit-frame-pointer -fwrapv -O3
Mon Aug 10 07:41:48 2026 ===  0.000067 === cpucycles/sparc32cpuinfo skipping architecture gcc -fPIC -Wall -fomit-frame-pointer -fwrapv -march=core-avx2 -O3
Mon Aug 10 07:41:48 2026 ===  0.000073 === cpucycles/sparc32cpuinfo skipping architecture clang -fPIC -Wall -fomit-frame-pointer -fwrapv -Qunused-arguments -O3
Mon Aug 10 07:41:48 2026 ===  0.000051 === cpucycles/sparc32cpuinfo skipping architecture clang -fPIC -Wall -fomit-frame-pointer -fwrapv -Qunused-arguments -mavx2 -O3
Mon Aug 10 07:41:48 2026 ===  0.000094 === cpucycles/sparccpuinfo skipping architecture gcc -fPIC -Wall -fomit-frame-pointer -fwrapv -O3
Mon Aug 10 07:41:48 2026 ===  0.000054 === cpucycles/sparccpuinfo skipping architecture gcc -fPIC -Wall -fomit-frame-pointer -fwrapv -march=core-avx2 -O3
Mon Aug 10 07:41:48 2026 ===  0.000049 === cpucycles/sparccpuinfo skipping architecture clang -fPIC -Wall -fomit-frame-pointer -fwrapv -Qunused-arguments -O3
Mon Aug 10 07:41:48 2026 ===  0.000049 === cpucycles/sparccpuinfo skipping architecture clang -fPIC -Wall -fomit-frame-pointer -fwrapv -Qunused-arguments -mavx2 -O3
Mon Aug 10 07:41:48 2026 ===  0.000099 === cpucycles/vct skipping architecture gcc -fPIC -Wall -fomit-frame-pointer -fwrapv -O3
Mon Aug 10 07:41:48 2026 ===  0.000050 === cpucycles/vct skipping architecture gcc -fPIC -Wall -fomit-frame-pointer -fwrapv -march=core-avx2 -O3
Mon Aug 10 07:41:48 2026 ===  0.000049 === cpucycles/vct skipping architecture clang -fPIC -Wall -fomit-frame-pointer -fwrapv -Qunused-arguments -O3
Mon Aug 10 07:41:48 2026 ===  0.000047 === cpucycles/vct skipping architecture clang -fPIC -Wall -fomit-frame-pointer -fwrapv -Qunused-arguments -mavx2 -O3
Mon Aug 10 07:41:48 2026 ===  0.000102 === cpucycles/x86cpuinfo skipping architecture gcc -fPIC -Wall -fomit-frame-pointer -fwrapv -O3
Mon Aug 10 07:41:48 2026 ===  0.000063 === cpucycles/x86cpuinfo skipping architecture gcc -fPIC -Wall -fomit-frame-pointer -fwrapv -march=core-avx2 -O3
Mon Aug 10 07:41:48 2026 ===  0.000049 === cpucycles/x86cpuinfo skipping architecture clang -fPIC -Wall -fomit-frame-pointer -fwrapv -Qunused-arguments -O3
Mon Aug 10 07:41:48 2026 ===  0.000047 === cpucycles/x86cpuinfo skipping architecture clang -fPIC -Wall -fomit-frame-pointer -fwrapv -Qunused-arguments -mavx2 -O3
Mon Aug 10 07:41:48 2026 ===  0.000096 === cpucycles/x86cpuspeed skipping architecture gcc -fPIC -Wall -fomit-frame-pointer -fwrapv -O3
Mon Aug 10 07:41:48 2026 ===  0.000058 === cpucycles/x86cpuspeed skipping architecture gcc -fPIC -Wall -fomit-frame-pointer -fwrapv -march=core-avx2 -O3
Mon Aug 10 07:41:48 2026 ===  0.000047 === cpucycles/x86cpuspeed skipping architecture clang -fPIC -Wall -fomit-frame-pointer -fwrapv -Qunused-arguments -O3
Mon Aug 10 07:41:48 2026 ===  0.000044 === cpucycles/x86cpuspeed skipping architecture clang -fPIC -Wall -fomit-frame-pointer -fwrapv -Qunused-arguments -mavx2 -O3
Mon Aug 10 07:41:48 2026 ===  0.000080 === cpucycles/x86estimate skipping architecture gcc -fPIC -Wall -fomit-frame-pointer -fwrapv -O3
Mon Aug 10 07:41:48 2026 ===  0.000051 === cpucycles/x86estimate skipping architecture gcc -fPIC -Wall -fomit-frame-pointer -fwrapv -march=core-avx2 -O3
Mon Aug 10 07:41:48 2026 ===  0.000051 === cpucycles/x86estimate skipping architecture clang -fPIC -Wall -fomit-frame-pointer -fwrapv -Qunused-arguments -O3
Mon Aug 10 07:41:48 2026 ===  0.000045 === cpucycles/x86estimate skipping architecture clang -fPIC -Wall -fomit-frame-pointer -fwrapv -Qunused-arguments -mavx2 -O3
Mon Aug 10 07:41:48 2026 ===  0.000088 === cpucycles/x86tscfreq skipping architecture gcc -fPIC -Wall -fomit-frame-pointer -fwrapv -O3
Mon Aug 10 07:41:48 2026 ===  0.000049 === cpucycles/x86tscfreq skipping architecture gcc -fPIC -Wall -fomit-frame-pointer -fwrapv -march=core-avx2 -O3
Mon Aug 10 07:41:48 2026 ===  0.000045 === cpucycles/x86tscfreq skipping architecture clang -fPIC -Wall -fomit-frame-pointer -fwrapv -Qunused-arguments -O3
Mon Aug 10 07:41:48 2026 ===  0.000046 === cpucycles/x86tscfreq skipping architecture clang -fPIC -Wall -fomit-frame-pointer -fwrapv -Qunused-arguments -mavx2 -O3
Mon Aug 10 07:41:48 2026 ===  0.001402 === int32/avx2 compiling gcc -fPIC -Wall -fomit-frame-pointer -fwrapv -O3
Mon Aug 10 07:41:48 2026 ===  0.000430 === int32/avx2/sort.c compiling
Mon Aug 10 07:41:49 2026 ===  1.430159 === output
> sort.c: In function ‘djbsort_int32’:
> sort.c:939:38: warning: AVX vector return without AVX enabled changes the ABI [-Wpsabi]
>   939 |     for (i = q>>3;i < q>>2;++i) y[i] = _mm256_set1_epi32(0x7fffffff);
>       |                                 ~~~~~^~~~~~~~~~~~~~~~~~~~~~~~~~~~~~~
> sort.c: In function ‘merge16_finish’:
> sort.c:54:13: note: the ABI for passing parameters with 32-byte alignment has changed in GCC 4.6
>    54 | static void merge16_finish(int32 *x,int32x8 x0,int32x8 x1,int flagdown)
>       |             ^~~~~~~~~~~~~~
> In file included from /usr/include/gcc-12/immintrin.h:43,
>                  from sort.c:4:
> /usr/include/gcc-12/avxintrin.h: In function ‘minmax_vector’:
> /usr/include/gcc-12/avxintrin.h:933:1: error: inlining failed in call to ‘always_inline’ ‘_mm256_storeu_si256’: target specific option mismatch
>   933 | _mm256_storeu_si256 (__m256i_u *__P, __m256i __A)
>       | ^~~~~~~~~~~~~~~~~~~
> sort.c:9:28: note: called from here
>     9 | #define int32x8_store(z,i) _mm256_storeu_si256((__m256i *) (z),(i))
>       |                            ^~~~~~~~~~~~~~~~~~~~~~~~~~~~~~~~~~~~~~~~
> sort.c:37:5: note: in expansion of macro ‘int32x8_store’
>    37 |     int32x8_store(y + n - 8,y0);
>       |     ^~~~~~~~~~~~~
> /usr/include/gcc-12/avxintrin.h:933:1: error: inlining failed in call to ‘always_inline’ ‘_mm256_storeu_si256’: target specific option mismatch
>   933 | _mm256_storeu_si256 (__m256i_u *__P, __m256i __A)
>       | ^~~~~~~~~~~~~~~~~~~
> sort.c:9:28: note: called from here
>     9 | #define int32x8_store(z,i) _mm256_storeu_si256((__m256i *) (z),(i))
>       |                            ^~~~~~~~~~~~~~~~~~~~~~~~~~~~~~~~~~~~~~~~
> sort.c:36:5: note: in expansion of macro ‘int32x8_store’
>    36 |     int32x8_store(x + n - 8,x0);
>       |     ^~~~~~~~~~~~~
> In file included from /usr/include/gcc-12/immintrin.h:47:
> /usr/include/gcc-12/avx2intrin.h:363:1: error: inlining failed in call to ‘always_inline’ ‘_mm256_max_epi32’: target specific option mismatch
>   363 | _mm256_max_epi32 (__m256i __A, __m256i __B)
>       | ^~~~~~~~~~~~~~~~
> sort.c:11:21: note: called from here
>    11 | #define int32x8_max _mm256_max_epi32
>       |                     ^
> sort.c:16:7: note: in expansion of macro ‘int32x8_max’
>    16 |   b = int32x8_max(a,b); \
>       |       ^~~~~~~~~~~
> sort.c:35:5: note: in expansion of macro ‘int32x8_MINMAX’
>    35 |     int32x8_MINMAX(x0,y0);
>       |     ^~~~~~~~~~~~~~
> /usr/include/gcc-12/avx2intrin.h:405:1: error: inlining failed in call to ‘always_inline’ ‘_mm256_min_epi32’: target specific option mismatch
>   405 | _mm256_min_epi32 (__m256i __A, __m256i __B)
>       | ^~~~~~~~~~~~~~~~
> sort.c:10:21: note: called from here
>    10 | #define int32x8_min _mm256_min_epi32
>       |                     ^
> sort.c:15:15: note: in expansion of macro ‘int32x8_min’
>    15 |   int32x8 c = int32x8_min(a,b); \
>       |               ^~~~~~~~~~~
> sort.c:35:5: note: in expansion of macro ‘int32x8_MINMAX’
>    35 |     int32x8_MINMAX(x0,y0);
>       |     ^~~~~~~~~~~~~~
> /usr/include/gcc-12/avxintrin.h:927:1: error: inlining failed in call to ‘always_inline’ ‘_mm256_loadu_si256’: target specific option mismatch
>   927 | _mm256_loadu_si256 (__m256i_u const *__P)
>       | ^~~~~~~~~~~~~~~~~~
> sort.c:8:25: note: called from here
>     8 | #define int32x8_load(z) _mm256_loadu_si256((__m256i *) (z))
>       |                         ^~~~~~~~~~~~~~~~~~~~~~~~~~~~~~~~~~~
> sort.c:34:18: note: in expansion of macro ‘int32x8_load’
>    34 |     int32x8 y0 = int32x8_load(y + n - 8);
>       |                  ^~~~~~~~~~~~
> /usr/include/gcc-12/avxintrin.h:927:1: error: inlining failed in call to ‘always_inline’ ‘_mm256_loadu_si256’: target specific option mismatch
>   927 | _mm256_loadu_si256 (__m256i_u const *__P)
>       | ^~~~~~~~~~~~~~~~~~
> sort.c:8:25: note: called from here
>     8 | #define int32x8_load(z) _mm256_loadu_si256((__m256i *) (z))
>       |                         ^~~~~~~~~~~~~~~~~~~~~~~~~~~~~~~~~~~
> sort.c:33:18: note: in expansion of macro ‘int32x8_load’
>    33 |     int32x8 x0 = int32x8_load(x + n - 8);
>       |                  ^~~~~~~~~~~~
> /usr/include/gcc-12/avxintrin.h:933:1: error: inlining failed in call to ‘always_inline’ ‘_mm256_storeu_si256’: target specific option mismatch
>   933 | _mm256_storeu_si256 (__m256i_u *__P, __m256i __A)
>       | ^~~~~~~~~~~~~~~~~~~
> sort.c:9:28: note: called from here
>     9 | #define int32x8_store(z,i) _mm256_storeu_si256((__m256i *) (z),(i))
>       |                            ^~~~~~~~~~~~~~~~~~~~~~~~~~~~~~~~~~~~~~~~
> sort.c:45:5: note: in expansion of macro ‘int32x8_store’
>    45 |     int32x8_store(y,y0);
>       |     ^~~~~~~~~~~~~
> /usr/include/gcc-12/avxintrin.h:933:1: error: inlining failed in call to ‘always_inline’ ‘_mm256_storeu_si256’: target specific option mismatch
>   933 | _mm256_storeu_si256 (__m256i_u *__P, __m256i __A)
>       | ^~~~~~~~~~~~~~~~~~~
> sort.c:9:28: note: called from here
>     9 | #define int32x8_store(z,i) _mm256_storeu_si256((__m256i *) (z),(i))
>       |                            ^~~~~~~~~~~~~~~~~~~~~~~~~~~~~~~~~~~~~~~~
> sort.c:44:5: note: in expansion of macro ‘int32x8_store’
>    44 |     int32x8_store(x,x0);
>       |     ^~~~~~~~~~~~~
> /usr/include/gcc-12/avx2intrin.h:363:1: error: inlining failed in call to ‘always_inline’ ‘_mm256_max_epi32’: target specific option mismatch
>   363 | _mm256_max_epi32 (__m256i __A, __m256i __B)
>       | ^~~~~~~~~~~~~~~~
> sort.c:11:21: note: called from here
>    11 | #define int32x8_max _mm256_max_epi32
>       |                     ^
> sort.c:16:7: note: in expansion of macro ‘int32x8_max’
>    16 |   b = int32x8_max(a,b); \
>       |       ^~~~~~~~~~~
> sort.c:43:5: note: in expansion of macro ‘int32x8_MINMAX’
>    43 |     int32x8_MINMAX(x0,y0);
>       |     ^~~~~~~~~~~~~~
> /usr/include/gcc-12/avx2intrin.h:405:1: error: inlining failed in call to ‘always_inline’ ‘_mm256_min_epi32’: target specific option mismatch
>   405 | _mm256_min_epi32 (__m256i __A, __m256i __B)
>       | ^~~~~~~~~~~~~~~~
> sort.c:10:21: note: called from here
>    10 | #define int32x8_min _mm256_min_epi32
>       |                     ^
> sort.c:15:15: note: in expansion of macro ‘int32x8_min’
>    15 |   int32x8 c = int32x8_min(a,b); \
>       |               ^~~~~~~~~~~
> sort.c:43:5: note: in expansion of macro ‘int32x8_MINMAX’
>    43 |     int32x8_MINMAX(x0,y0);
>       |     ^~~~~~~~~~~~~~
> /usr/include/gcc-12/avxintrin.h:927:1: error: inlining failed in call to ‘always_inline’ ‘_mm256_loadu_si256’: target specific option mismatch
>   927 | _mm256_loadu_si256 (__m256i_u const *__P)
>       | ^~~~~~~~~~~~~~~~~~
> sort.c:8:25: note: called from here
>     8 | #define int32x8_load(z) _mm256_loadu_si256((__m256i *) (z))
>       |                         ^~~~~~~~~~~~~~~~~~~~~~~~~~~~~~~~~~~
> sort.c:42:18: note: in expansion of macro ‘int32x8_load’
>    42 |     int32x8 y0 = int32x8_load(y);
>       |                  ^~~~~~~~~~~~
> /usr/include/gcc-12/avxintrin.h:927:1: error: inlining failed in call to ‘always_inline’ ‘_mm256_loadu_si256’: target specific option mismatch
>   927 | _mm256_loadu_si256 (__m256i_u const *__P)
>       | ^~~~~~~~~~~~~~~~~~
> sort.c:8:25: note: called from here
>     8 | #define int32x8_load(z) _mm256_loadu_si256((__m256i *) (z))
>       |                         ^~~~~~~~~~~~~~~~~~~~~~~~~~~~~~~~~~~
> sort.c:41:18: note: in expansion of macro ‘int32x8_load’
>    41 |     int32x8 x0 = int32x8_load(x);
>       |                  ^~~~~~~~~~~~
Mon Aug 10 07:41:49 2026 ===  0.000551 === int32/avx2/sort.c compiler exited 1
Mon Aug 10 07:41:49 2026 ===  0.000112 === int32/avx2/compiler.c compiling
Mon Aug 10 07:41:49 2026 ===  0.028416 === int32/avx2/version.c compiling
Mon Aug 10 07:41:49 2026 ===  0.030351 === int32/avx2/implementation.c compiling
Mon Aug 10 07:41:50 2026 ===  0.338925 === int32/avx2/cycles.c compiling
Mon Aug 10 07:41:50 2026 ===  0.159330 === int32/avx2/works.c compiling
Mon Aug 10 07:41:50 2026 ===  0.239950 === int32/avx2 compiling gcc -fPIC -Wall -fomit-frame-pointer -fwrapv -march=core-avx2 -O3
Mon Aug 10 07:41:50 2026 ===  0.000354 === int32/avx2/sort.c compiling
Mon Aug 10 07:41:51 2026 ===  1.227550 === int32/avx2/compiler.c compiling
Mon Aug 10 07:41:51 2026 ===  0.031232 === int32/avx2/version.c compiling
Mon Aug 10 07:41:51 2026 ===  0.032343 === int32/avx2/implementation.c compiling
Mon Aug 10 07:41:52 2026 ===  0.169561 === int32/avx2/cycles.c compiling
Mon Aug 10 07:41:52 2026 ===  0.114645 === int32/avx2/works.c compiling
Mon Aug 10 07:41:52 2026 ===  0.153119 === int32/avx2 compiled gcc -fPIC -Wall -fomit-frame-pointer -fwrapv -march=core-avx2 -O3
Mon Aug 10 07:41:52 2026 ===  0.022709 === int32/avx2 compiling clang -fPIC -Wall -fomit-frame-pointer -fwrapv -Qunused-arguments -O3
Mon Aug 10 07:41:52 2026 ===  0.000261 === int32/avx2/sort.c compiling
Mon Aug 10 07:41:52 2026 ===  0.023866 === output
> gcc: error: unrecognized command-line option ‘-Qunused-arguments’
Mon Aug 10 07:41:52 2026 ===  0.000439 === int32/avx2/sort.c compiler exited 1
Mon Aug 10 07:41:52 2026 ===  0.000107 === int32/avx2/compiler.c compiling
Mon Aug 10 07:41:52 2026 ===  0.023915 === output
> gcc: error: unrecognized command-line option ‘-Qunused-arguments’
Mon Aug 10 07:41:52 2026 ===  0.000419 === int32/avx2/compiler.c compiler exited 1
Mon Aug 10 07:41:52 2026 ===  0.000101 === int32/avx2/version.c compiling
Mon Aug 10 07:41:52 2026 ===  0.021699 === output
> gcc: error: unrecognized command-line option ‘-Qunused-arguments’
Mon Aug 10 07:41:52 2026 ===  0.000422 === int32/avx2/version.c compiler exited 1
Mon Aug 10 07:41:52 2026 ===  0.000115 === int32/avx2/implementation.c compiling
Mon Aug 10 07:41:52 2026 ===  0.024081 === output
> gcc: error: unrecognized command-line option ‘-Qunused-arguments’
Mon Aug 10 07:41:52 2026 ===  0.000408 === int32/avx2/implementation.c compiler exited 1
Mon Aug 10 07:41:52 2026 ===  0.000099 === int32/avx2/cycles.c compiling
Mon Aug 10 07:41:52 2026 ===  0.023942 === output
> gcc: error: unrecognized command-line option ‘-Qunused-arguments’
Mon Aug 10 07:41:52 2026 ===  0.000401 === int32/avx2/cycles.c compiler exited 1
Mon Aug 10 07:41:52 2026 ===  0.000116 === int32/avx2/works.c compiling
Mon Aug 10 07:41:52 2026 ===  0.023894 === output
> gcc: error: unrecognized command-line option ‘-Qunused-arguments’
Mon Aug 10 07:41:52 2026 ===  0.000426 === int32/avx2/works.c compiler exited 1
Mon Aug 10 07:41:52 2026 ===  0.000245 === int32/avx2 compiling clang -fPIC -Wall -fomit-frame-pointer -fwrapv -Qunused-arguments -mavx2 -O3
Mon Aug 10 07:41:52 2026 ===  0.000167 === int32/avx2/sort.c compiling
Mon Aug 10 07:41:52 2026 ===  0.024863 === output
> gcc: error: unrecognized command-line option ‘-Qunused-arguments’
Mon Aug 10 07:41:52 2026 ===  0.000460 === int32/avx2/sort.c compiler exited 1
Mon Aug 10 07:41:52 2026 ===  0.000120 === int32/avx2/compiler.c compiling
Mon Aug 10 07:41:52 2026 ===  0.023845 === output
> gcc: error: unrecognized command-line option ‘-Qunused-arguments’
Mon Aug 10 07:41:52 2026 ===  0.000437 === int32/avx2/compiler.c compiler exited 1
Mon Aug 10 07:41:52 2026 ===  0.000102 === int32/avx2/version.c compiling
Mon Aug 10 07:41:52 2026 ===  0.023825 === output
> gcc: error: unrecognized command-line option ‘-Qunused-arguments’
Mon Aug 10 07:41:52 2026 ===  0.000438 === int32/avx2/version.c compiler exited 1
Mon Aug 10 07:41:52 2026 ===  0.000108 === int32/avx2/implementation.c compiling
Mon Aug 10 07:41:52 2026 ===  0.024076 === output
> gcc: error: unrecognized command-line option ‘-Qunused-arguments’
Mon Aug 10 07:41:52 2026 ===  0.000440 === int32/avx2/implementation.c compiler exited 1
Mon Aug 10 07:41:52 2026 ===  0.000112 === int32/avx2/cycles.c compiling
Mon Aug 10 07:41:52 2026 ===  0.023059 === output
> gcc: error: unrecognized command-line option ‘-Qunused-arguments’
Mon Aug 10 07:41:52 2026 ===  0.000426 === int32/avx2/cycles.c compiler exited 1
Mon Aug 10 07:41:52 2026 ===  0.000102 === int32/avx2/works.c compiling
Mon Aug 10 07:41:52 2026 ===  0.022321 === output
> gcc: error: unrecognized command-line option ‘-Qunused-arguments’
Mon Aug 10 07:41:52 2026 ===  0.000490 === int32/avx2/works.c compiler exited 1
Mon Aug 10 07:41:52 2026 ===  0.001875 === int32/portable3 compiling gcc -fPIC -Wall -fomit-frame-pointer -fwrapv -O3
Mon Aug 10 07:41:52 2026 ===  0.000158 === int32/portable3/sort.c compiling
Mon Aug 10 07:41:52 2026 ===  0.071078 === int32/portable3/compiler.c compiling
Mon Aug 10 07:41:52 2026 ===  0.032438 === int32/portable3/version.c compiling
Mon Aug 10 07:41:52 2026 ===  0.132232 === int32/portable3/implementation.c compiling
Mon Aug 10 07:41:52 2026 ===  0.029737 === int32/portable3/cycles.c compiling
Mon Aug 10 07:41:53 2026 ===  0.094449 === int32/portable3/works.c compiling
Mon Aug 10 07:41:53 2026 ===  0.141564 === int32/portable3 compiled gcc -fPIC -Wall -fomit-frame-pointer -fwrapv -O3
Mon Aug 10 07:41:53 2026 ===  0.024822 === int32/portable3 compiling gcc -fPIC -Wall -fomit-frame-pointer -fwrapv -march=core-avx2 -O3
Mon Aug 10 07:41:53 2026 ===  0.000332 === int32/portable3/sort.c compiling
Mon Aug 10 07:41:53 2026 ===  0.110625 === int32/portable3/compiler.c compiling
Mon Aug 10 07:41:53 2026 ===  0.034285 === int32/portable3/version.c compiling
Mon Aug 10 07:41:53 2026 ===  0.199753 === int32/portable3/implementation.c compiling
Mon Aug 10 07:41:53 2026 ===  0.257159 === int32/portable3/cycles.c compiling
Mon Aug 10 07:41:53 2026 ===  0.126752 === int32/portable3/works.c compiling
Mon Aug 10 07:41:54 2026 ===  0.150787 === int32/portable3 compiled gcc -fPIC -Wall -fomit-frame-pointer -fwrapv -march=core-avx2 -O3
Mon Aug 10 07:41:54 2026 ===  0.021833 === int32/portable3 compiling clang -fPIC -Wall -fomit-frame-pointer -fwrapv -Qunused-arguments -O3
Mon Aug 10 07:41:54 2026 ===  0.000256 === int32/portable3/sort.c compiling
Mon Aug 10 07:41:54 2026 ===  0.023921 === output
> gcc: error: unrecognized command-line option ‘-Qunused-arguments’
Mon Aug 10 07:41:54 2026 ===  0.000447 === int32/portable3/sort.c compiler exited 1
Mon Aug 10 07:41:54 2026 ===  0.000116 === int32/portable3/compiler.c compiling
Mon Aug 10 07:41:54 2026 ===  0.024336 === output
> gcc: error: unrecognized command-line option ‘-Qunused-arguments’
Mon Aug 10 07:41:54 2026 ===  0.000450 === int32/portable3/compiler.c compiler exited 1
Mon Aug 10 07:41:54 2026 ===  0.000102 === int32/portable3/version.c compiling
Mon Aug 10 07:41:54 2026 ===  0.021769 === output
> gcc: error: unrecognized command-line option ‘-Qunused-arguments’
Mon Aug 10 07:41:54 2026 ===  0.000419 === int32/portable3/version.c compiler exited 1
Mon Aug 10 07:41:54 2026 ===  0.000095 === int32/portable3/implementation.c compiling
Mon Aug 10 07:41:54 2026 ===  0.021349 === output
> gcc: error: unrecognized command-line option ‘-Qunused-arguments’
Mon Aug 10 07:41:54 2026 ===  0.000450 === int32/portable3/implementation.c compiler exited 1
Mon Aug 10 07:41:54 2026 ===  0.000119 === int32/portable3/cycles.c compiling
Mon Aug 10 07:41:54 2026 ===  0.203973 === output
> gcc: error: unrecognized command-line option ‘-Qunused-arguments’
Mon Aug 10 07:41:54 2026 ===  0.000488 === int32/portable3/cycles.c compiler exited 1
Mon Aug 10 07:41:54 2026 ===  0.000123 === int32/portable3/works.c compiling
Mon Aug 10 07:41:54 2026 ===  0.023332 === output
> gcc: error: unrecognized command-line option ‘-Qunused-arguments’
Mon Aug 10 07:41:54 2026 ===  0.000492 === int32/portable3/works.c compiler exited 1
Mon Aug 10 07:41:54 2026 ===  0.000140 === int32/portable3 compiling clang -fPIC -Wall -fomit-frame-pointer -fwrapv -Qunused-arguments -mavx2 -O3
Mon Aug 10 07:41:54 2026 ===  0.000223 === int32/portable3/sort.c compiling
Mon Aug 10 07:41:54 2026 ===  0.023073 === output
> gcc: error: unrecognized command-line option ‘-Qunused-arguments’
Mon Aug 10 07:41:54 2026 ===  0.000433 === int32/portable3/sort.c compiler exited 1
Mon Aug 10 07:41:54 2026 ===  0.000106 === int32/portable3/compiler.c compiling
Mon Aug 10 07:41:54 2026 ===  0.023878 === output
> gcc: error: unrecognized command-line option ‘-Qunused-arguments’
Mon Aug 10 07:41:54 2026 ===  0.000526 === int32/portable3/compiler.c compiler exited 1
Mon Aug 10 07:41:54 2026 ===  0.000130 === int32/portable3/version.c compiling
Mon Aug 10 07:41:54 2026 ===  0.023919 === output
> gcc: error: unrecognized command-line option ‘-Qunused-arguments’
Mon Aug 10 07:41:54 2026 ===  0.000468 === int32/portable3/version.c compiler exited 1
Mon Aug 10 07:41:54 2026 ===  0.000115 === int32/portable3/implementation.c compiling
Mon Aug 10 07:41:54 2026 ===  0.022870 === output
> gcc: error: unrecognized command-line option ‘-Qunused-arguments’
Mon Aug 10 07:41:54 2026 ===  0.000472 === int32/portable3/implementation.c compiler exited 1
Mon Aug 10 07:41:54 2026 ===  0.000107 === int32/portable3/cycles.c compiling
Mon Aug 10 07:41:54 2026 ===  0.022655 === output
> gcc: error: unrecognized command-line option ‘-Qunused-arguments’
Mon Aug 10 07:41:54 2026 ===  0.000442 === int32/portable3/cycles.c compiler exited 1
Mon Aug 10 07:41:54 2026 ===  0.000126 === int32/portable3/works.c compiling
Mon Aug 10 07:41:54 2026 ===  0.023983 === output
> gcc: error: unrecognized command-line option ‘-Qunused-arguments’
Mon Aug 10 07:41:54 2026 ===  0.000432 === int32/portable3/works.c compiler exited 1
Mon Aug 10 07:41:54 2026 ===  0.001537 === int32/portable4 compiling gcc -fPIC -Wall -fomit-frame-pointer -fwrapv -O3
Mon Aug 10 07:41:54 2026 ===  0.000140 === int32/portable4/sort.c compiling
Mon Aug 10 07:41:54 2026 ===  0.171734 === int32/portable4/compiler.c compiling
Mon Aug 10 07:41:55 2026 ===  0.266417 === int32/portable4/version.c compiling
Mon Aug 10 07:41:55 2026 ===  0.033551 === int32/portable4/implementation.c compiling
Mon Aug 10 07:41:55 2026 ===  0.032135 === int32/portable4/cycles.c compiling
Mon Aug 10 07:41:55 2026 ===  0.208373 === int32/portable4/works.c compiling
Mon Aug 10 07:41:55 2026 ===  0.139685 === int32/portable4 compiled gcc -fPIC -Wall -fomit-frame-pointer -fwrapv -O3
Mon Aug 10 07:41:55 2026 ===  0.022936 === int32/portable4 compiling gcc -fPIC -Wall -fomit-frame-pointer -fwrapv -march=core-avx2 -O3
Mon Aug 10 07:41:55 2026 ===  0.000330 === int32/portable4/sort.c compiling
Mon Aug 10 07:41:55 2026 ===  0.168065 === int32/portable4/compiler.c compiling
Mon Aug 10 07:41:55 2026 ===  0.034470 === int32/portable4/version.c compiling
Mon Aug 10 07:41:55 2026 ===  0.058931 === int32/portable4/implementation.c compiling
Mon Aug 10 07:41:55 2026 ===  0.031613 === int32/portable4/cycles.c compiling
Mon Aug 10 07:41:55 2026 ===  0.131643 === int32/portable4/works.c compiling
Mon Aug 10 07:41:56 2026 ===  0.155685 === int32/portable4 compiled gcc -fPIC -Wall -fomit-frame-pointer -fwrapv -march=core-avx2 -O3
Mon Aug 10 07:41:56 2026 ===  0.020048 === int32/portable4 compiling clang -fPIC -Wall -fomit-frame-pointer -fwrapv -Qunused-arguments -O3
Mon Aug 10 07:41:56 2026 ===  0.000263 === int32/portable4/sort.c compiling
Mon Aug 10 07:41:56 2026 ===  0.021794 === output
> gcc: error: unrecognized command-line option ‘-Qunused-arguments’
Mon Aug 10 07:41:56 2026 ===  0.000376 === int32/portable4/sort.c compiler exited 1
Mon Aug 10 07:41:56 2026 ===  0.000115 === int32/portable4/compiler.c compiling
Mon Aug 10 07:41:56 2026 ===  0.022562 === output
> gcc: error: unrecognized command-line option ‘-Qunused-arguments’
Mon Aug 10 07:41:56 2026 ===  0.000459 === int32/portable4/compiler.c compiler exited 1
Mon Aug 10 07:41:56 2026 ===  0.000121 === int32/portable4/version.c compiling
Mon Aug 10 07:41:56 2026 ===  0.022868 === output
> gcc: error: unrecognized command-line option ‘-Qunused-arguments’
Mon Aug 10 07:41:56 2026 ===  0.000422 === int32/portable4/version.c compiler exited 1
Mon Aug 10 07:41:56 2026 ===  0.000108 === int32/portable4/implementation.c compiling
Mon Aug 10 07:41:56 2026 ===  0.025962 === output
> gcc: error: unrecognized command-line option ‘-Qunused-arguments’
Mon Aug 10 07:41:56 2026 ===  0.000455 === int32/portable4/implementation.c compiler exited 1
Mon Aug 10 07:41:56 2026 ===  0.000122 === int32/portable4/cycles.c compiling
Mon Aug 10 07:41:56 2026 ===  0.022728 === output
> gcc: error: unrecognized command-line option ‘-Qunused-arguments’
Mon Aug 10 07:41:56 2026 ===  0.000450 === int32/portable4/cycles.c compiler exited 1
Mon Aug 10 07:41:56 2026 ===  0.000126 === int32/portable4/works.c compiling
Mon Aug 10 07:41:56 2026 ===  0.022996 === output
> gcc: error: unrecognized command-line option ‘-Qunused-arguments’
Mon Aug 10 07:41:56 2026 ===  0.000438 === int32/portable4/works.c compiler exited 1
Mon Aug 10 07:41:56 2026 ===  0.000126 === int32/portable4 compiling clang -fPIC -Wall -fomit-frame-pointer -fwrapv -Qunused-arguments -mavx2 -O3
Mon Aug 10 07:41:56 2026 ===  0.000207 === int32/portable4/sort.c compiling
Mon Aug 10 07:41:56 2026 ===  0.023551 === output
> gcc: error: unrecognized command-line option ‘-Qunused-arguments’
Mon Aug 10 07:41:56 2026 ===  0.000456 === int32/portable4/sort.c compiler exited 1
Mon Aug 10 07:41:56 2026 ===  0.000128 === int32/portable4/compiler.c compiling
Mon Aug 10 07:41:56 2026 ===  0.021755 === output
> gcc: error: unrecognized command-line option ‘-Qunused-arguments’
Mon Aug 10 07:41:56 2026 ===  0.000449 === int32/portable4/compiler.c compiler exited 1
Mon Aug 10 07:41:56 2026 ===  0.000128 === int32/portable4/version.c compiling
Mon Aug 10 07:41:56 2026 ===  0.021510 === output
> gcc: error: unrecognized command-line option ‘-Qunused-arguments’
Mon Aug 10 07:41:56 2026 ===  0.000442 === int32/portable4/version.c compiler exited 1
Mon Aug 10 07:41:56 2026 ===  0.000119 === int32/portable4/implementation.c compiling
Mon Aug 10 07:41:56 2026 ===  0.023344 === output
> gcc: error: unrecognized command-line option ‘-Qunused-arguments’
Mon Aug 10 07:41:56 2026 ===  0.000460 === int32/portable4/implementation.c compiler exited 1
Mon Aug 10 07:41:56 2026 ===  0.000125 === int32/portable4/cycles.c compiling
Mon Aug 10 07:41:56 2026 ===  0.024132 === output
> gcc: error: unrecognized command-line option ‘-Qunused-arguments’
Mon Aug 10 07:41:56 2026 ===  0.000422 === int32/portable4/cycles.c compiler exited 1
Mon Aug 10 07:41:56 2026 ===  0.000114 === int32/portable4/works.c compiling
Mon Aug 10 07:41:56 2026 ===  0.022970 === output
> gcc: error: unrecognized command-line option ‘-Qunused-arguments’
Mon Aug 10 07:41:56 2026 ===  0.000442 === int32/portable4/works.c compiler exited 1
Mon Aug 10 07:41:56 2026 ===  0.001894 === uint32/useint32 compiling gcc -fPIC -Wall -fomit-frame-pointer -fwrapv -O3
Mon Aug 10 07:41:56 2026 ===  0.000156 === uint32/useint32/sort.c compiling
Mon Aug 10 07:41:56 2026 ===  0.067703 === uint32/useint32/compiler.c compiling
Mon Aug 10 07:41:56 2026 ===  0.033718 === uint32/useint32/version.c compiling
Mon Aug 10 07:41:56 2026 ===  0.036092 === uint32/useint32/implementation.c compiling
Mon Aug 10 07:41:56 2026 ===  0.033313 === uint32/useint32/cycles.c compiling
Mon Aug 10 07:41:56 2026 ===  0.110453 === uint32/useint32/works.c compiling
Mon Aug 10 07:41:56 2026 ===  0.100584 === uint32/useint32 compiled gcc -fPIC -Wall -fomit-frame-pointer -fwrapv -O3
Mon Aug 10 07:41:56 2026 ===  0.021899 === uint32/useint32 compiling gcc -fPIC -Wall -fomit-frame-pointer -fwrapv -march=core-avx2 -O3
Mon Aug 10 07:41:56 2026 ===  0.000331 === uint32/useint32/sort.c compiling
Mon Aug 10 07:41:56 2026 ===  0.186251 === uint32/useint32/compiler.c compiling
Mon Aug 10 07:41:56 2026 ===  0.033054 === uint32/useint32/version.c compiling
Mon Aug 10 07:41:57 2026 ===  0.032783 === uint32/useint32/implementation.c compiling
Mon Aug 10 07:41:57 2026 ===  0.082806 === uint32/useint32/cycles.c compiling
Mon Aug 10 07:41:57 2026 ===  0.137344 === uint32/useint32/works.c compiling
Mon Aug 10 07:41:57 2026 ===  0.106174 === uint32/useint32 compiled gcc -fPIC -Wall -fomit-frame-pointer -fwrapv -march=core-avx2 -O3
Mon Aug 10 07:41:57 2026 ===  0.021123 === uint32/useint32 compiling clang -fPIC -Wall -fomit-frame-pointer -fwrapv -Qunused-arguments -O3
Mon Aug 10 07:41:57 2026 ===  0.000296 === uint32/useint32/sort.c compiling
Mon Aug 10 07:41:57 2026 ===  0.024874 === output
> gcc: error: unrecognized command-line option ‘-Qunused-arguments’
Mon Aug 10 07:41:57 2026 ===  0.000486 === uint32/useint32/sort.c compiler exited 1
Mon Aug 10 07:41:57 2026 ===  0.000101 === uint32/useint32/compiler.c compiling
Mon Aug 10 07:41:57 2026 ===  0.023990 === output
> gcc: error: unrecognized command-line option ‘-Qunused-arguments’
Mon Aug 10 07:41:57 2026 ===  0.000442 === uint32/useint32/compiler.c compiler exited 1
Mon Aug 10 07:41:57 2026 ===  0.000094 === uint32/useint32/version.c compiling
Mon Aug 10 07:41:57 2026 ===  0.022803 === output
> gcc: error: unrecognized command-line option ‘-Qunused-arguments’
Mon Aug 10 07:41:57 2026 ===  0.000509 === uint32/useint32/version.c compiler exited 1
Mon Aug 10 07:41:57 2026 ===  0.000121 === uint32/useint32/implementation.c compiling
Mon Aug 10 07:41:57 2026 ===  0.026232 === output
> gcc: error: unrecognized command-line option ‘-Qunused-arguments’
Mon Aug 10 07:41:57 2026 ===  0.000507 === uint32/useint32/implementation.c compiler exited 1
Mon Aug 10 07:41:57 2026 ===  0.000115 === uint32/useint32/cycles.c compiling
Mon Aug 10 07:41:57 2026 ===  0.028635 === output
> gcc: error: unrecognized command-line option ‘-Qunused-arguments’
Mon Aug 10 07:41:57 2026 ===  0.000474 === uint32/useint32/cycles.c compiler exited 1
Mon Aug 10 07:41:57 2026 ===  0.000124 === uint32/useint32/works.c compiling
Mon Aug 10 07:41:57 2026 ===  0.023498 === output
> gcc: error: unrecognized command-line option ‘-Qunused-arguments’
Mon Aug 10 07:41:57 2026 ===  0.000504 === uint32/useint32/works.c compiler exited 1
Mon Aug 10 07:41:57 2026 ===  0.000143 === uint32/useint32 compiling clang -fPIC -Wall -fomit-frame-pointer -fwrapv -Qunused-arguments -mavx2 -O3
Mon Aug 10 07:41:57 2026 ===  0.000241 === uint32/useint32/sort.c compiling
Mon Aug 10 07:41:57 2026 ===  0.024539 === output
> gcc: error: unrecognized command-line option ‘-Qunused-arguments’
Mon Aug 10 07:41:57 2026 ===  0.000488 === uint32/useint32/sort.c compiler exited 1
Mon Aug 10 07:41:57 2026 ===  0.000123 === uint32/useint32/compiler.c compiling
Mon Aug 10 07:41:57 2026 ===  0.023614 === output
> gcc: error: unrecognized command-line option ‘-Qunused-arguments’
Mon Aug 10 07:41:57 2026 ===  0.000463 === uint32/useint32/compiler.c compiler exited 1
Mon Aug 10 07:41:57 2026 ===  0.000129 === uint32/useint32/version.c compiling
Mon Aug 10 07:41:57 2026 ===  0.024389 === output
> gcc: error: unrecognized command-line option ‘-Qunused-arguments’
Mon Aug 10 07:41:57 2026 ===  0.000464 === uint32/useint32/version.c compiler exited 1
Mon Aug 10 07:41:57 2026 ===  0.000132 === uint32/useint32/implementation.c compiling
Mon Aug 10 07:41:57 2026 ===  0.023168 === output
> gcc: error: unrecognized command-line option ‘-Qunused-arguments’
Mon Aug 10 07:41:57 2026 ===  0.000468 === uint32/useint32/implementation.c compiler exited 1
Mon Aug 10 07:41:57 2026 ===  0.000116 === uint32/useint32/cycles.c compiling
Mon Aug 10 07:41:57 2026 ===  0.026154 === output
> gcc: error: unrecognized command-line option ‘-Qunused-arguments’
Mon Aug 10 07:41:57 2026 ===  0.000457 === uint32/useint32/cycles.c compiler exited 1
Mon Aug 10 07:41:57 2026 ===  0.000118 === uint32/useint32/works.c compiling
Mon Aug 10 07:41:57 2026 ===  0.025066 === output
> gcc: error: unrecognized command-line option ‘-Qunused-arguments’
Mon Aug 10 07:41:57 2026 ===  0.000513 === uint32/useint32/works.c compiler exited 1
Mon Aug 10 07:41:57 2026 ===  0.001877 === float32/useint32 compiling gcc -fPIC -Wall -fomit-frame-pointer -fwrapv -O3
Mon Aug 10 07:41:57 2026 ===  0.000150 === float32/useint32/sort.c compiling
Mon Aug 10 07:41:57 2026 ===  0.084771 === float32/useint32/compiler.c compiling
Mon Aug 10 07:41:57 2026 ===  0.028772 === float32/useint32/version.c compiling
Mon Aug 10 07:41:57 2026 ===  0.044222 === float32/useint32/implementation.c compiling
Mon Aug 10 07:41:57 2026 ===  0.033109 === float32/useint32/cycles.c compiling
Mon Aug 10 07:41:57 2026 ===  0.092232 === float32/useint32/works.c compiling
Mon Aug 10 07:41:58 2026 ===  0.118770 === float32/useint32 compiled gcc -fPIC -Wall -fomit-frame-pointer -fwrapv -O3
Mon Aug 10 07:41:58 2026 ===  0.021595 === float32/useint32 compiling gcc -fPIC -Wall -fomit-frame-pointer -fwrapv -march=core-avx2 -O3
Mon Aug 10 07:41:58 2026 ===  0.000293 === float32/useint32/sort.c compiling
Mon Aug 10 07:41:58 2026 ===  0.071770 === float32/useint32/compiler.c compiling
Mon Aug 10 07:41:58 2026 ===  0.033223 === float32/useint32/version.c compiling
Mon Aug 10 07:41:58 2026 ===  0.030598 === float32/useint32/implementation.c compiling
Mon Aug 10 07:41:58 2026 ===  0.031388 === float32/useint32/cycles.c compiling
Mon Aug 10 07:41:58 2026 ===  0.553774 === float32/useint32/works.c compiling
Mon Aug 10 07:41:58 2026 ===  0.085311 === float32/useint32 compiled gcc -fPIC -Wall -fomit-frame-pointer -fwrapv -march=core-avx2 -O3
Mon Aug 10 07:41:58 2026 ===  0.030029 === float32/useint32 compiling clang -fPIC -Wall -fomit-frame-pointer -fwrapv -Qunused-arguments -O3
Mon Aug 10 07:41:58 2026 ===  0.000319 === float32/useint32/sort.c compiling
Mon Aug 10 07:41:59 2026 ===  0.091134 === output
> gcc: error: unrecognized command-line option ‘-Qunused-arguments’
Mon Aug 10 07:41:59 2026 ===  0.000515 === float32/useint32/sort.c compiler exited 1
Mon Aug 10 07:41:59 2026 ===  0.000118 === float32/useint32/compiler.c compiling
Mon Aug 10 07:41:59 2026 ===  0.206339 === output
> gcc: error: unrecognized command-line option ‘-Qunused-arguments’
Mon Aug 10 07:41:59 2026 ===  0.000486 === float32/useint32/compiler.c compiler exited 1
Mon Aug 10 07:41:59 2026 ===  0.000111 === float32/useint32/version.c compiling
Mon Aug 10 07:41:59 2026 ===  0.022715 === output
> gcc: error: unrecognized command-line option ‘-Qunused-arguments’
Mon Aug 10 07:41:59 2026 ===  0.000502 === float32/useint32/version.c compiler exited 1
Mon Aug 10 07:41:59 2026 ===  0.000113 === float32/useint32/implementation.c compiling
Mon Aug 10 07:41:59 2026 ===  0.022389 === output
> gcc: error: unrecognized command-line option ‘-Qunused-arguments’
Mon Aug 10 07:41:59 2026 ===  0.000504 === float32/useint32/implementation.c compiler exited 1
Mon Aug 10 07:41:59 2026 ===  0.000117 === float32/useint32/cycles.c compiling
Mon Aug 10 07:41:59 2026 ===  0.022381 === output
> gcc: error: unrecognized command-line option ‘-Qunused-arguments’
Mon Aug 10 07:41:59 2026 ===  0.000483 === float32/useint32/cycles.c compiler exited 1
Mon Aug 10 07:41:59 2026 ===  0.000125 === float32/useint32/works.c compiling
Mon Aug 10 07:41:59 2026 ===  0.022066 === output
> gcc: error: unrecognized command-line option ‘-Qunused-arguments’
Mon Aug 10 07:41:59 2026 ===  0.000460 === float32/useint32/works.c compiler exited 1
Mon Aug 10 07:41:59 2026 ===  0.000131 === float32/useint32 compiling clang -fPIC -Wall -fomit-frame-pointer -fwrapv -Qunused-arguments -mavx2 -O3
Mon Aug 10 07:41:59 2026 ===  0.000217 === float32/useint32/sort.c compiling
Mon Aug 10 07:41:59 2026 ===  0.025888 === output
> gcc: error: unrecognized command-line option ‘-Qunused-arguments’
Mon Aug 10 07:41:59 2026 ===  0.000496 === float32/useint32/sort.c compiler exited 1
Mon Aug 10 07:41:59 2026 ===  0.000125 === float32/useint32/compiler.c compiling
Mon Aug 10 07:41:59 2026 ===  0.026954 === output
> gcc: error: unrecognized command-line option ‘-Qunused-arguments’
Mon Aug 10 07:41:59 2026 ===  0.000451 === float32/useint32/compiler.c compiler exited 1
Mon Aug 10 07:41:59 2026 ===  0.000113 === float32/useint32/version.c compiling
Mon Aug 10 07:41:59 2026 ===  0.022567 === output
> gcc: error: unrecognized command-line option ‘-Qunused-arguments’
Mon Aug 10 07:41:59 2026 ===  0.000461 === float32/useint32/version.c compiler exited 1
Mon Aug 10 07:41:59 2026 ===  0.000114 === float32/useint32/implementation.c compiling
Mon Aug 10 07:41:59 2026 ===  0.023026 === output
> gcc: error: unrecognized command-line option ‘-Qunused-arguments’
Mon Aug 10 07:41:59 2026 ===  0.000475 === float32/useint32/implementation.c compiler exited 1
Mon Aug 10 07:41:59 2026 ===  0.000136 === float32/useint32/cycles.c compiling
Mon Aug 10 07:41:59 2026 ===  0.022323 === output
> gcc: error: unrecognized command-line option ‘-Qunused-arguments’
Mon Aug 10 07:41:59 2026 ===  0.000494 === float32/useint32/cycles.c compiler exited 1
Mon Aug 10 07:41:59 2026 ===  0.000129 === float32/useint32/works.c compiling
Mon Aug 10 07:41:59 2026 ===  0.022755 === output
> gcc: error: unrecognized command-line option ‘-Qunused-arguments’
Mon Aug 10 07:41:59 2026 ===  0.000514 === float32/useint32/works.c compiler exited 1
Mon Aug 10 07:41:59 2026 ===  0.000154 === command/limits.c compiling gcc -fPIC -Wall -fomit-frame-pointer -fwrapv -O3
Mon Aug 10 07:41:59 2026 ===  0.102690 === command/limits.c compiling gcc -fPIC -Wall -fomit-frame-pointer -fwrapv -march=core-avx2 -O3
Mon Aug 10 07:41:59 2026 ===  0.056078 === command/limits.c compiling clang -fPIC -Wall -fomit-frame-pointer -fwrapv -Qunused-arguments -O3
Mon Aug 10 07:41:59 2026 ===  0.025265 === output
> gcc: error: unrecognized command-line option ‘-Qunused-arguments’
Mon Aug 10 07:41:59 2026 ===  0.000448 === command/limits.c compiler exited 1
Mon Aug 10 07:41:59 2026 ===  0.000121 === command/limits.c compiling clang -fPIC -Wall -fomit-frame-pointer -fwrapv -Qunused-arguments -mavx2 -O3
Mon Aug 10 07:41:59 2026 ===  0.026025 === output
> gcc: error: unrecognized command-line option ‘-Qunused-arguments’
Mon Aug 10 07:41:59 2026 ===  0.000440 === command/limits.c compiler exited 1
Mon Aug 10 07:41:59 2026 ===  0.000787 === command/int32-speed.c compiling gcc -fPIC -Wall -fomit-frame-pointer -fwrapv -O3
Mon Aug 10 07:41:59 2026 ===  0.095931 === command/int32-speed.c compiling gcc -fPIC -Wall -fomit-frame-pointer -fwrapv -march=core-avx2 -O3
Mon Aug 10 07:41:59 2026 ===  0.141332 === command/int32-speed.c compiling clang -fPIC -Wall -fomit-frame-pointer -fwrapv -Qunused-arguments -O3
Mon Aug 10 07:41:59 2026 ===  0.021840 === output
> gcc: error: unrecognized command-line option ‘-Qunused-arguments’
Mon Aug 10 07:41:59 2026 ===  0.000455 === command/int32-speed.c compiler exited 1
Mon Aug 10 07:41:59 2026 ===  0.000093 === command/int32-speed.c compiling clang -fPIC -Wall -fomit-frame-pointer -fwrapv -Qunused-arguments -mavx2 -O3
Mon Aug 10 07:41:59 2026 ===  0.021865 === output
> gcc: error: unrecognized command-line option ‘-Qunused-arguments’
Mon Aug 10 07:41:59 2026 ===  0.000453 === command/int32-speed.c compiler exited 1
Mon Aug 10 07:41:59 2026 ===  0.000788 === command/uint32-speed.c compiling gcc -fPIC -Wall -fomit-frame-pointer -fwrapv -O3
Mon Aug 10 07:42:00 2026 ===  0.139777 === command/uint32-speed.c compiling gcc -fPIC -Wall -fomit-frame-pointer -fwrapv -march=core-avx2 -O3
Mon Aug 10 07:42:00 2026 ===  0.088429 === command/uint32-speed.c compiling clang -fPIC -Wall -fomit-frame-pointer -fwrapv -Qunused-arguments -O3
Mon Aug 10 07:42:00 2026 ===  0.023729 === output
> gcc: error: unrecognized command-line option ‘-Qunused-arguments’
Mon Aug 10 07:42:00 2026 ===  0.000402 === command/uint32-speed.c compiler exited 1
Mon Aug 10 07:42:00 2026 ===  0.000082 === command/uint32-speed.c compiling clang -fPIC -Wall -fomit-frame-pointer -fwrapv -Qunused-arguments -mavx2 -O3
Mon Aug 10 07:42:00 2026 ===  0.021919 === output
> gcc: error: unrecognized command-line option ‘-Qunused-arguments’
Mon Aug 10 07:42:00 2026 ===  0.000424 === command/uint32-speed.c compiler exited 1
Mon Aug 10 07:42:00 2026 ===  0.000650 === command/float32-speed.c compiling gcc -fPIC -Wall -fomit-frame-pointer -fwrapv -O3
Mon Aug 10 07:42:00 2026 ===  0.094759 === command/float32-speed.c compiling gcc -fPIC -Wall -fomit-frame-pointer -fwrapv -march=core-avx2 -O3
Mon Aug 10 07:42:00 2026 ===  0.121743 === command/float32-speed.c compiling clang -fPIC -Wall -fomit-frame-pointer -fwrapv -Qunused-arguments -O3
Mon Aug 10 07:42:00 2026 ===  0.024155 === output
> gcc: error: unrecognized command-line option ‘-Qunused-arguments’
Mon Aug 10 07:42:00 2026 ===  0.000450 === command/float32-speed.c compiler exited 1
Mon Aug 10 07:42:00 2026 ===  0.000085 === command/float32-speed.c compiling clang -fPIC -Wall -fomit-frame-pointer -fwrapv -Qunused-arguments -mavx2 -O3
Mon Aug 10 07:42:00 2026 ===  0.023188 === output
> gcc: error: unrecognized command-line option ‘-Qunused-arguments’
Mon Aug 10 07:42:00 2026 ===  0.000392 === command/float32-speed.c compiler exited 1
Mon Aug 10 07:42:00 2026 ===  0.000283 === build finishing successfully
